Build Linux: FAILED devel/qemu on x86_64-linux-gnu (pixman-0.42.2-x86_64-linux-gnu-1)
OAR Tester for Ubuntu 22.04
rtems-tester at oarcorp.com
Wed Apr 2 06:55:28 UTC 2025
RTEMS Source Builder - Set Builder, 6 (edc391f7985d)
Host: Linux-6.8.0-51-generic-x86_64-with-Ubuntu-22.04-jammy
Linux VM-Ubuntu22.rtems.com 6.8.0-51-generic #52~22.04.1-Ubuntu SMP
PREEMPT_DYNAMIC Mon Dec 9 15:00:52 UTC 2 x86_64 x86_64
Build Time: 0:01:50.060516
= = = = = = = = = = = = = = = = = = = = = = = = = = = = = = = = = = = = = = = =
Build FAILED: pixman-0.42.2-x86_64-linux-gnu-1
- - - - - - - - - - - - - - - - - - - - - - - - - - - - - - - - - - - - - - - -
checking size of size_t... 8
checking for C compiler vendor... gnu
checking whether C compiler accepts -fstrict-aliasing... yes
checking whether C compiler accepts -ffast-math... yes
checking for gcc architecture flag...
checking for x86 cpuid 0 output... 16:756e6547:6c65746e:49656e69
checking for x86 cpuid 1 output... a0655:80800:fefa3203:178bfbff
checking whether C compiler accepts -march=core2... yes
checking for gcc architecture flag... -march=core2
checking whether C compiler accepts -O3 -fomit-frame-pointer -fstrict-aliasing -ffast-math -march=core2... yes
checking CFLAGS for maximum warnings... -Wall
checking whether to enable maintainer-specific portions of Makefiles... no
checking sys/mman.h usability... yes
checking sys/mman.h presence... yes
checking for sys/mman.h... yes
checking for mmap... yes
checking for sys/mman.h... (cached) yes
checking for mmap... (cached) yes
checking whether read-only mmap of a plain file works... yes
checking whether mmap from /dev/zero works... yes
checking for MAP_ANON(YMOUS)... yes
checking whether mmap with MAP_ANON(YMOUS) works... yes
checking for ANSI C header files... (cached) yes
checking for memcpy... yes
checking for size_t... yes
checking for working alloca.h... yes
checking for alloca... yes
checking size of double... 8
checking size of long double... 16
checking whether byte ordering is bigendian... no
checking assembler .cfi pseudo-op support... yes
checking assembler supports pc related relocs... yes
checking assembler .ascii pseudo-op support... yes
checking assembler .string pseudo-op support... yes
checking assembler supports unwind section type... yes
checking whether .eh_frame section should be read-only... yes
checking for __attribute__((visibility("hidden")))... yes
checking that generated files are newer than configure... done
configure: creating ./config.status
config.status: creating include/Makefile
config.status: creating include/ffi.h
config.status: creating Makefile
config.status: creating testsuite/Makefile
config.status: creating man/Makefile
config.status: creating libffi.pc
config.status: creating fficonfig.h
config.status: linking ../libffi-3.0.13/src/x86/ffitarget.h to include/ffitarget.h
config.status: executing buildir commands
config.status: skipping top_srcdir/Makefile - not created
config.status: executing depfiles commands
config.status: executing libtool commands
config.status: executing include commands
config.status: executing src commands
+ make -j 8 all
make "AR_FLAGS=" "CC_FOR_BUILD=gcc -O2 -g -pipe -I/home/tester/rtems-cron-6/rtems-source-builder/bare/build/tmp/sb-1002/devel/qemu/home/tester/rtems-cron-6/tools/6/include -I/home/tester/rtems-cron-6/rtems-source-builder/bare/build/tmp/sb-1002-internal/include" "CFLAGS=-O3 -fomit-frame-pointer -fstrict-aliasing -ffast-math -march=core2 -Wall -fexceptions" "CXXFLAGS=" "CFLAGS_FOR_BUILD=" "CFLAGS_FOR_TARGET=" "INSTALL=/usr/bin/install -c" "INSTALL_DATA=/usr/bin/install -c -m 644" "INSTALL_PROGRAM=/usr/bin/install -c" "INSTALL_SCRIPT=/usr/bin/install -c" "JC1FLAGS=" "LDFLAGS=-L/home/tester/rtems-cron-6/rtems-source-builder/bare/build/tmp/sb-1002-internal/lib" "LIBCFLAGS=" "LIBCFLAGS_FOR_TARGET=" "MAKE=make" "MAKEINFO=/bin/bash /home/tester/rtems-cron-6/rtems-source-builder/bare/build/libffi-3.0.13-x86_64-linux-gnu-1/libffi-3.0.13/missing --run makeinfo " "PICFLAG=" "PICFLAG_FOR_TARGET=" "RUNTESTFLAGS=" "SHELL=/bin/bash" "exec_prefix=/home/tester/rtems-cron-6/tools/6" "infodir=/home/tes
ter/rtems-cron-6/tools/6/share/info" "libdir=/home/tester/rtems-cron-6/tools/6/lib" "mandir=/home/tester/rtems-cron-6/tools/6/share/man" "prefix=/home/tester/rtems-cron-6/tools/6" "AR=x86_64-linux-gnu-ar" "AS=as" "CC=gcc -O2 -g -pipe -I/home/tester/rtems-cron-6/rtems-source-builder/bare/build/tmp/sb-1002/devel/qemu/home/tester/rtems-cron-6/tools/6/include -I/home/tester/rtems-cron-6/rtems-source-builder/bare/build/tmp/sb-1002-internal/include" "CXX=g++ -O2 -g -pipe -I/home/tester/rtems-cron-6/rtems-source-builder/bare/build/tmp/sb-1002/devel/qemu/home/tester/rtems-cron-6/tools/6/include -I/home/tester/rtems-cron-6/rtems-source-builder/bare/build/tmp/sb-1002-internal/include" "LD=/usr/bin/ld -m elf_x86_64" "NM=/usr/bin/nm -B" "RANLIB=x86_64-linux-gnu-ranlib" "DESTDIR=" all-recursive
make[1]: Entering directory '/home/tester/rtems-cron-6/rtems-source-builder/bare/build/libffi-3.0.13-x86_64-linux-gnu-1/build'
Making all in include
make[2]: Entering directory '/home/tester/rtems-cron-6/rtems-source-builder/bare/build/libffi-3.0.13-x86_64-linux-gnu-1/build/include'
make[2]: Nothing to be done for 'all'.
make[2]: Leaving directory '/home/tester/rtems-cron-6/rtems-source-builder/bare/build/libffi-3.0.13-x86_64-linux-gnu-1/build/include'
Making all in testsuite
make[2]: Entering directory '/home/tester/rtems-cron-6/rtems-source-builder/bare/build/libffi-3.0.13-x86_64-linux-gnu-1/build/testsuite'
make[2]: Nothing to be done for 'all'.
make[2]: Leaving directory '/home/tester/rtems-cron-6/rtems-source-builder/bare/build/libffi-3.0.13-x86_64-linux-gnu-1/build/testsuite'
Making all in man
make[2]: Entering directory '/home/tester/rtems-cron-6/rtems-source-builder/bare/build/libffi-3.0.13-x86_64-linux-gnu-1/build/man'
make[2]: Nothing to be done for 'all'.
make[2]: Leaving directory '/home/tester/rtems-cron-6/rtems-source-builder/bare/build/libffi-3.0.13-x86_64-linux-gnu-1/build/man'
make[2]: Entering directory '/home/tester/rtems-cron-6/rtems-source-builder/bare/build/libffi-3.0.13-x86_64-linux-gnu-1/build'
depbase=`echo src/prep_cif.lo | sed 's|[^/]*$|.deps/&|;s|\.lo$||'`;\
/bin/bash ./libtool --tag=CC --mode=compile gcc -O2 -g -pipe -I/home/tester/rtems-cron-6/rtems-source-builder/bare/build/tmp/sb-1002/devel/qemu/home/tester/rtems-cron-6/tools/6/include -I/home/tester/rtems-cron-6/rtems-source-builder/bare/build/tmp/sb-1002-internal/include -DHAVE_CONFIG_H -I. -I../libffi-3.0.13 -I. -I../libffi-3.0.13/include -Iinclude -I../libffi-3.0.13/src -O3 -fomit-frame-pointer -fstrict-aliasing -ffast-math -march=core2 -Wall -fexceptions -MT src/prep_cif.lo -MD -MP -MF $depbase.Tpo -c -o src/prep_cif.lo ../libffi-3.0.13/src/prep_cif.c &&\
mv -f $depbase.Tpo $depbase.Plo
depbase=`echo src/types.lo | sed 's|[^/]*$|.deps/&|;s|\.lo$||'`;\
/bin/bash ./libtool --tag=CC --mode=compile gcc -O2 -g -pipe -I/home/tester/rtems-cron-6/rtems-source-builder/bare/build/tmp/sb-1002/devel/qemu/home/tester/rtems-cron-6/tools/6/include -I/home/tester/rtems-cron-6/rtems-source-builder/bare/build/tmp/sb-1002-internal/include -DHAVE_CONFIG_H -I. -I../libffi-3.0.13 -I. -I../libffi-3.0.13/include -Iinclude -I../libffi-3.0.13/src -O3 -fomit-frame-pointer -fstrict-aliasing -ffast-math -march=core2 -Wall -fexceptions -MT src/types.lo -MD -MP -MF $depbase.Tpo -c -o src/types.lo ../libffi-3.0.13/src/types.c &&\
mv -f $depbase.Tpo $depbase.Plo
depbase=`echo src/raw_api.lo | sed 's|[^/]*$|.deps/&|;s|\.lo$||'`;\
/bin/bash ./libtool --tag=CC --mode=compile gcc -O2 -g -pipe -I/home/tester/rtems-cron-6/rtems-source-builder/bare/build/tmp/sb-1002/devel/qemu/home/tester/rtems-cron-6/tools/6/include -I/home/tester/rtems-cron-6/rtems-source-builder/bare/build/tmp/sb-1002-internal/include -DHAVE_CONFIG_H -I. -I../libffi-3.0.13 -I. -I../libffi-3.0.13/include -Iinclude -I../libffi-3.0.13/src -O3 -fomit-frame-pointer -fstrict-aliasing -ffast-math -march=core2 -Wall -fexceptions -MT src/raw_api.lo -MD -MP -MF $depbase.Tpo -c -o src/raw_api.lo ../libffi-3.0.13/src/raw_api.c &&\
mv -f $depbase.Tpo $depbase.Plo
depbase=`echo src/java_raw_api.lo | sed 's|[^/]*$|.deps/&|;s|\.lo$||'`;\
/bin/bash ./libtool --tag=CC --mode=compile gcc -O2 -g -pipe -I/home/tester/rtems-cron-6/rtems-source-builder/bare/build/tmp/sb-1002/devel/qemu/home/tester/rtems-cron-6/tools/6/include -I/home/tester/rtems-cron-6/rtems-source-builder/bare/build/tmp/sb-1002-internal/include -DHAVE_CONFIG_H -I. -I../libffi-3.0.13 -I. -I../libffi-3.0.13/include -Iinclude -I../libffi-3.0.13/src -O3 -fomit-frame-pointer -fstrict-aliasing -ffast-math -march=core2 -Wall -fexceptions -MT src/java_raw_api.lo -MD -MP -MF $depbase.Tpo -c -o src/java_raw_api.lo ../libffi-3.0.13/src/java_raw_api.c &&\
mv -f $depbase.Tpo $depbase.Plo
depbase=`echo src/closures.lo | sed 's|[^/]*$|.deps/&|;s|\.lo$||'`;\
/bin/bash ./libtool --tag=CC --mode=compile gcc -O2 -g -pipe -I/home/tester/rtems-cron-6/rtems-source-builder/bare/build/tmp/sb-1002/devel/qemu/home/tester/rtems-cron-6/tools/6/include -I/home/tester/rtems-cron-6/rtems-source-builder/bare/build/tmp/sb-1002-internal/include -DHAVE_CONFIG_H -I. -I../libffi-3.0.13 -I. -I../libffi-3.0.13/include -Iinclude -I../libffi-3.0.13/src -O3 -fomit-frame-pointer -fstrict-aliasing -ffast-math -march=core2 -Wall -fexceptions -MT src/closures.lo -MD -MP -MF $depbase.Tpo -c -o src/closures.lo ../libffi-3.0.13/src/closures.c &&\
mv -f $depbase.Tpo $depbase.Plo
depbase=`echo src/x86/ffi64.lo | sed 's|[^/]*$|.deps/&|;s|\.lo$||'`;\
/bin/bash ./libtool --tag=CC --mode=compile gcc -O2 -g -pipe -I/home/tester/rtems-cron-6/rtems-source-builder/bare/build/tmp/sb-1002/devel/qemu/home/tester/rtems-cron-6/tools/6/include -I/home/tester/rtems-cron-6/rtems-source-builder/bare/build/tmp/sb-1002-internal/include -DHAVE_CONFIG_H -I. -I../libffi-3.0.13 -I. -I../libffi-3.0.13/include -Iinclude -I../libffi-3.0.13/src -O3 -fomit-frame-pointer -fstrict-aliasing -ffast-math -march=core2 -Wall -fexceptions -MT src/x86/ffi64.lo -MD -MP -MF $depbase.Tpo -c -o src/x86/ffi64.lo ../libffi-3.0.13/src/x86/ffi64.c &&\
mv -f $depbase.Tpo $depbase.Plo
depbase=`echo src/x86/unix64.lo | sed 's|[^/]*$|.deps/&|;s|\.lo$||'`;\
/bin/bash ./libtool --mode=compile gcc -O2 -g -pipe -I/home/tester/rtems-cron-6/rtems-source-builder/bare/build/tmp/sb-1002/devel/qemu/home/tester/rtems-cron-6/tools/6/include -I/home/tester/rtems-cron-6/rtems-source-builder/bare/build/tmp/sb-1002-internal/include -DHAVE_CONFIG_H -I. -I../libffi-3.0.13 -I. -I../libffi-3.0.13/include -Iinclude -I../libffi-3.0.13/src -I. -I../libffi-3.0.13/include -Iinclude -I../libffi-3.0.13/src -MT src/x86/unix64.lo -MD -MP -MF $depbase.Tpo -c -o src/x86/unix64.lo ../libffi-3.0.13/src/x86/unix64.S &&\
mv -f $depbase.Tpo $depbase.Plo
depbase=`echo src/x86/ffi.lo | sed 's|[^/]*$|.deps/&|;s|\.lo$||'`;\
/bin/bash ./libtool --tag=CC --mode=compile gcc -O2 -g -pipe -I/home/tester/rtems-cron-6/rtems-source-builder/bare/build/tmp/sb-1002/devel/qemu/home/tester/rtems-cron-6/tools/6/include -I/home/tester/rtems-cron-6/rtems-source-builder/bare/build/tmp/sb-1002-internal/include -DHAVE_CONFIG_H -I. -I../libffi-3.0.13 -I. -I../libffi-3.0.13/include -Iinclude -I../libffi-3.0.13/src -O3 -fomit-frame-pointer -fstrict-aliasing -ffast-math -march=core2 -Wall -fexceptions -MT src/x86/ffi.lo -MD -MP -MF $depbase.Tpo -c -o src/x86/ffi.lo ../libffi-3.0.13/src/x86/ffi.c &&\
mv -f $depbase.Tpo $depbase.Plo
libtool: compile: gcc -O2 -g -pipe -I/home/tester/rtems-cron-6/rtems-source-builder/bare/build/tmp/sb-1002/devel/qemu/home/tester/rtems-cron-6/tools/6/include -I/home/tester/rtems-cron-6/rtems-source-builder/bare/build/tmp/sb-1002-internal/include -DHAVE_CONFIG_H -I. -I../libffi-3.0.13 -I. -I../libffi-3.0.13/include -Iinclude -I../libffi-3.0.13/src -O3 -fomit-frame-pointer -fstrict-aliasing -ffast-math -march=core2 -Wall -fexceptions -MT src/java_raw_api.lo -MD -MP -MF src/.deps/java_raw_api.Tpo -c ../libffi-3.0.13/src/java_raw_api.c -fPIC -DPIC -o src/.libs/java_raw_api.o
libtool: compile: gcc -O2 -g -pipe -I/home/tester/rtems-cron-6/rtems-source-builder/bare/build/tmp/sb-1002/devel/qemu/home/tester/rtems-cron-6/tools/6/include -I/home/tester/rtems-cron-6/rtems-source-builder/bare/build/tmp/sb-1002-internal/include -DHAVE_CONFIG_H -I. -I../libffi-3.0.13 -I. -I../libffi-3.0.13/include -Iinclude -I../libffi-3.0.13/src -O3 -fomit-frame-pointer -fstrict-aliasing -ffast-math -march=core2 -Wall -fexceptions -MT src/prep_cif.lo -MD -MP -MF src/.deps/prep_cif.Tpo -c ../libffi-3.0.13/src/prep_cif.c -fPIC -DPIC -o src/.libs/prep_cif.o
libtool: compile: gcc -O2 -g -pipe -I/home/tester/rtems-cron-6/rtems-source-builder/bare/build/tmp/sb-1002/devel/qemu/home/tester/rtems-cron-6/tools/6/include -I/home/tester/rtems-cron-6/rtems-source-builder/bare/build/tmp/sb-1002-internal/include -DHAVE_CONFIG_H -I. -I../libffi-3.0.13 -I. -I../libffi-3.0.13/include -Iinclude -I../libffi-3.0.13/src -O3 -fomit-frame-pointer -fstrict-aliasing -ffast-math -march=core2 -Wall -fexceptions -MT src/closures.lo -MD -MP -MF src/.deps/closures.Tpo -c ../libffi-3.0.13/src/closures.c -fPIC -DPIC -o src/.libs/closures.o
libtool: compile: gcc -O2 -g -pipe -I/home/tester/rtems-cron-6/rtems-source-builder/bare/build/tmp/sb-1002/devel/qemu/home/tester/rtems-cron-6/tools/6/include -I/home/tester/rtems-cron-6/rtems-source-builder/bare/build/tmp/sb-1002-internal/include -DHAVE_CONFIG_H -I. -I../libffi-3.0.13 -I. -I../libffi-3.0.13/include -Iinclude -I../libffi-3.0.13/src -O3 -fomit-frame-pointer -fstrict-aliasing -ffast-math -march=core2 -Wall -fexceptions -MT src/x86/ffi64.lo -MD -MP -MF src/x86/.deps/ffi64.Tpo -c ../libffi-3.0.13/src/x86/ffi64.c -fPIC -DPIC -o src/x86/.libs/ffi64.o
libtool: compile: gcc -O2 -g -pipe -I/home/tester/rtems-cron-6/rtems-source-builder/bare/build/tmp/sb-1002/devel/qemu/home/tester/rtems-cron-6/tools/6/include -I/home/tester/rtems-cron-6/rtems-source-builder/bare/build/tmp/sb-1002-internal/include -DHAVE_CONFIG_H -I. -I../libffi-3.0.13 -I. -I../libffi-3.0.13/include -Iinclude -I../libffi-3.0.13/src -O3 -fomit-frame-pointer -fstrict-aliasing -ffast-math -march=core2 -Wall -fexceptions -MT src/raw_api.lo -MD -MP -MF src/.deps/raw_api.Tpo -c ../libffi-3.0.13/src/raw_api.c -fPIC -DPIC -o src/.libs/raw_api.o
libtool: compile: gcc -O2 -g -pipe -I/home/tester/rtems-cron-6/rtems-source-builder/bare/build/tmp/sb-1002/devel/qemu/home/tester/rtems-cron-6/tools/6/include -I/home/tester/rtems-cron-6/rtems-source-builder/bare/build/tmp/sb-1002-internal/include -DHAVE_CONFIG_H -I. -I../libffi-3.0.13 -I. -I../libffi-3.0.13/include -Iinclude -I../libffi-3.0.13/src -O3 -fomit-frame-pointer -fstrict-aliasing -ffast-math -march=core2 -Wall -fexceptions -MT src/x86/ffi.lo -MD -MP -MF src/x86/.deps/ffi.Tpo -c ../libffi-3.0.13/src/x86/ffi.c -fPIC -DPIC -o src/x86/.libs/ffi.o
libtool: compile: gcc -O2 -g -pipe -I/home/tester/rtems-cron-6/rtems-source-builder/bare/build/tmp/sb-1002/devel/qemu/home/tester/rtems-cron-6/tools/6/include -I/home/tester/rtems-cron-6/rtems-source-builder/bare/build/tmp/sb-1002-internal/include -DHAVE_CONFIG_H -I. -I../libffi-3.0.13 -I. -I../libffi-3.0.13/include -Iinclude -I../libffi-3.0.13/src -O3 -fomit-frame-pointer -fstrict-aliasing -ffast-math -march=core2 -Wall -fexceptions -MT src/types.lo -MD -MP -MF src/.deps/types.Tpo -c ../libffi-3.0.13/src/types.c -fPIC -DPIC -o src/.libs/types.o
libtool: compile: gcc -O2 -g -pipe -I/home/tester/rtems-cron-6/rtems-source-builder/bare/build/tmp/sb-1002/devel/qemu/home/tester/rtems-cron-6/tools/6/include -I/home/tester/rtems-cron-6/rtems-source-builder/bare/build/tmp/sb-1002-internal/include -DHAVE_CONFIG_H -I. -I../libffi-3.0.13 -I. -I../libffi-3.0.13/include -Iinclude -I../libffi-3.0.13/src -I. -I../libffi-3.0.13/include -Iinclude -I../libffi-3.0.13/src -MT src/x86/unix64.lo -MD -MP -MF src/x86/.deps/unix64.Tpo -c ../libffi-3.0.13/src/x86/unix64.S -fPIC -DPIC -o src/x86/.libs/unix64.o
libtool: compile: gcc -O2 -g -pipe -I/home/tester/rtems-cron-6/rtems-source-builder/bare/build/tmp/sb-1002/devel/qemu/home/tester/rtems-cron-6/tools/6/include -I/home/tester/rtems-cron-6/rtems-source-builder/bare/build/tmp/sb-1002-internal/include -DHAVE_CONFIG_H -I. -I../libffi-3.0.13 -I. -I../libffi-3.0.13/include -Iinclude -I../libffi-3.0.13/src -O3 -fomit-frame-pointer -fstrict-aliasing -ffast-math -march=core2 -Wall -fexceptions -MT src/x86/ffi.lo -MD -MP -MF src/x86/.deps/ffi.Tpo -c ../libffi-3.0.13/src/x86/ffi.c -o src/x86/ffi.o >/dev/null 2>&1
libtool: compile: gcc -O2 -g -pipe -I/home/tester/rtems-cron-6/rtems-source-builder/bare/build/tmp/sb-1002/devel/qemu/home/tester/rtems-cron-6/tools/6/include -I/home/tester/rtems-cron-6/rtems-source-builder/bare/build/tmp/sb-1002-internal/include -DHAVE_CONFIG_H -I. -I../libffi-3.0.13 -I. -I../libffi-3.0.13/include -Iinclude -I../libffi-3.0.13/src -O3 -fomit-frame-pointer -fstrict-aliasing -ffast-math -march=core2 -Wall -fexceptions -MT src/types.lo -MD -MP -MF src/.deps/types.Tpo -c ../libffi-3.0.13/src/types.c -o src/types.o >/dev/null 2>&1
libtool: compile: gcc -O2 -g -pipe -I/home/tester/rtems-cron-6/rtems-source-builder/bare/build/tmp/sb-1002/devel/qemu/home/tester/rtems-cron-6/tools/6/include -I/home/tester/rtems-cron-6/rtems-source-builder/bare/build/tmp/sb-1002-internal/include -DHAVE_CONFIG_H -I. -I../libffi-3.0.13 -I. -I../libffi-3.0.13/include -Iinclude -I../libffi-3.0.13/src -I. -I../libffi-3.0.13/include -Iinclude -I../libffi-3.0.13/src -MT src/x86/unix64.lo -MD -MP -MF src/x86/.deps/unix64.Tpo -c ../libffi-3.0.13/src/x86/unix64.S -o src/x86/unix64.o >/dev/null 2>&1
depbase=`echo src/x86/sysv.lo | sed 's|[^/]*$|.deps/&|;s|\.lo$||'`;\
/bin/bash ./libtool --mode=compile gcc -O2 -g -pipe -I/home/tester/rtems-cron-6/rtems-source-builder/bare/build/tmp/sb-1002/devel/qemu/home/tester/rtems-cron-6/tools/6/include -I/home/tester/rtems-cron-6/rtems-source-builder/bare/build/tmp/sb-1002-internal/include -DHAVE_CONFIG_H -I. -I../libffi-3.0.13 -I. -I../libffi-3.0.13/include -Iinclude -I../libffi-3.0.13/src -I. -I../libffi-3.0.13/include -Iinclude -I../libffi-3.0.13/src -MT src/x86/sysv.lo -MD -MP -MF $depbase.Tpo -c -o src/x86/sysv.lo ../libffi-3.0.13/src/x86/sysv.S &&\
mv -f $depbase.Tpo $depbase.Plo
libtool: compile: gcc -O2 -g -pipe -I/home/tester/rtems-cron-6/rtems-source-builder/bare/build/tmp/sb-1002/devel/qemu/home/tester/rtems-cron-6/tools/6/include -I/home/tester/rtems-cron-6/rtems-source-builder/bare/build/tmp/sb-1002-internal/include -DHAVE_CONFIG_H -I. -I../libffi-3.0.13 -I. -I../libffi-3.0.13/include -Iinclude -I../libffi-3.0.13/src -I. -I../libffi-3.0.13/include -Iinclude -I../libffi-3.0.13/src -MT src/x86/sysv.lo -MD -MP -MF src/x86/.deps/sysv.Tpo -c ../libffi-3.0.13/src/x86/sysv.S -fPIC -DPIC -o src/x86/.libs/sysv.o
libtool: compile: gcc -O2 -g -pipe -I/home/tester/rtems-cron-6/rtems-source-builder/bare/build/tmp/sb-1002/devel/qemu/home/tester/rtems-cron-6/tools/6/include -I/home/tester/rtems-cron-6/rtems-source-builder/bare/build/tmp/sb-1002-internal/include -DHAVE_CONFIG_H -I. -I../libffi-3.0.13 -I. -I../libffi-3.0.13/include -Iinclude -I../libffi-3.0.13/src -I. -I../libffi-3.0.13/include -Iinclude -I../libffi-3.0.13/src -MT src/x86/sysv.lo -MD -MP -MF src/x86/.deps/sysv.Tpo -c ../libffi-3.0.13/src/x86/sysv.S -o src/x86/sysv.o >/dev/null 2>&1
libtool: compile: gcc -O2 -g -pipe -I/home/tester/rtems-cron-6/rtems-source-builder/bare/build/tmp/sb-1002/devel/qemu/home/tester/rtems-cron-6/tools/6/include -I/home/tester/rtems-cron-6/rtems-source-builder/bare/build/tmp/sb-1002-internal/include -DHAVE_CONFIG_H -I. -I../libffi-3.0.13 -I. -I../libffi-3.0.13/include -Iinclude -I../libffi-3.0.13/src -O3 -fomit-frame-pointer -fstrict-aliasing -ffast-math -march=core2 -Wall -fexceptions -MT src/java_raw_api.lo -MD -MP -MF src/.deps/java_raw_api.Tpo -c ../libffi-3.0.13/src/java_raw_api.c -o src/java_raw_api.o >/dev/null 2>&1
libtool: compile: gcc -O2 -g -pipe -I/home/tester/rtems-cron-6/rtems-source-builder/bare/build/tmp/sb-1002/devel/qemu/home/tester/rtems-cron-6/tools/6/include -I/home/tester/rtems-cron-6/rtems-source-builder/bare/build/tmp/sb-1002-internal/include -DHAVE_CONFIG_H -I. -I../libffi-3.0.13 -I. -I../libffi-3.0.13/include -Iinclude -I../libffi-3.0.13/src -O3 -fomit-frame-pointer -fstrict-aliasing -ffast-math -march=core2 -Wall -fexceptions -MT src/raw_api.lo -MD -MP -MF src/.deps/raw_api.Tpo -c ../libffi-3.0.13/src/raw_api.c -o src/raw_api.o >/dev/null 2>&1
libtool: compile: gcc -O2 -g -pipe -I/home/tester/rtems-cron-6/rtems-source-builder/bare/build/tmp/sb-1002/devel/qemu/home/tester/rtems-cron-6/tools/6/include -I/home/tester/rtems-cron-6/rtems-source-builder/bare/build/tmp/sb-1002-internal/include -DHAVE_CONFIG_H -I. -I../libffi-3.0.13 -I. -I../libffi-3.0.13/include -Iinclude -I../libffi-3.0.13/src -O3 -fomit-frame-pointer -fstrict-aliasing -ffast-math -march=core2 -Wall -fexceptions -MT src/prep_cif.lo -MD -MP -MF src/.deps/prep_cif.Tpo -c ../libffi-3.0.13/src/prep_cif.c -o src/prep_cif.o >/dev/null 2>&1
../libffi-3.0.13/src/closures.c: In function 'dlmmap_locked':
../libffi-3.0.13/src/closures.c:444:7: warning: ignoring return value of 'ftruncate' declared with attribute 'warn_unused_result' [-Wunused-result]
444 | ftruncate (execfd, offset);
| ^~~~~~~~~~~~~~~~~~~~~~~~~~
../libffi-3.0.13/src/closures.c:456:7: warning: ignoring return value of 'ftruncate' declared with attribute 'warn_unused_result' [-Wunused-result]
456 | ftruncate (execfd, offset);
| ^~~~~~~~~~~~~~~~~~~~~~~~~~
libtool: compile: gcc -O2 -g -pipe -I/home/tester/rtems-cron-6/rtems-source-builder/bare/build/tmp/sb-1002/devel/qemu/home/tester/rtems-cron-6/tools/6/include -I/home/tester/rtems-cron-6/rtems-source-builder/bare/build/tmp/sb-1002-internal/include -DHAVE_CONFIG_H -I. -I../libffi-3.0.13 -I. -I../libffi-3.0.13/include -Iinclude -I../libffi-3.0.13/src -O3 -fomit-frame-pointer -fstrict-aliasing -ffast-math -march=core2 -Wall -fexceptions -MT src/x86/ffi64.lo -MD -MP -MF src/x86/.deps/ffi64.Tpo -c ../libffi-3.0.13/src/x86/ffi64.c -o src/x86/ffi64.o >/dev/null 2>&1
libtool: compile: gcc -O2 -g -pipe -I/home/tester/rtems-cron-6/rtems-source-builder/bare/build/tmp/sb-1002/devel/qemu/home/tester/rtems-cron-6/tools/6/include -I/home/tester/rtems-cron-6/rtems-source-builder/bare/build/tmp/sb-1002-internal/include -DHAVE_CONFIG_H -I. -I../libffi-3.0.13 -I. -I../libffi-3.0.13/include -Iinclude -I../libffi-3.0.13/src -O3 -fomit-frame-pointer -fstrict-aliasing -ffast-math -march=core2 -Wall -fexceptions -MT src/closures.lo -MD -MP -MF src/.deps/closures.Tpo -c ../libffi-3.0.13/src/closures.c -o src/closures.o >/dev/null 2>&1
/bin/bash ./libtool --tag=CC --mode=link gcc -O2 -g -pipe -I/home/tester/rtems-cron-6/rtems-source-builder/bare/build/tmp/sb-1002/devel/qemu/home/tester/rtems-cron-6/tools/6/include -I/home/tester/rtems-cron-6/rtems-source-builder/bare/build/tmp/sb-1002-internal/include -O3 -fomit-frame-pointer -fstrict-aliasing -ffast-math -march=core2 -Wall -fexceptions -L/home/tester/rtems-cron-6/rtems-source-builder/bare/build/tmp/sb-1002-internal/lib -o libffi_convenience.la src/prep_cif.lo src/types.lo src/raw_api.lo src/java_raw_api.lo src/closures.lo src/x86/ffi64.lo src/x86/unix64.lo src/x86/ffi.lo src/x86/sysv.lo
/bin/bash ./libtool --tag=CC --mode=link gcc -O2 -g -pipe -I/home/tester/rtems-cron-6/rtems-source-builder/bare/build/tmp/sb-1002/devel/qemu/home/tester/rtems-cron-6/tools/6/include -I/home/tester/rtems-cron-6/rtems-source-builder/bare/build/tmp/sb-1002-internal/include -O3 -fomit-frame-pointer -fstrict-aliasing -ffast-math -march=core2 -Wall -fexceptions -no-undefined -version-info `grep -v '^#' ../libffi-3.0.13/libtool-version` '-L/home/tester/rtems-cron-6/rtems-source-builder/bare/build/tmp/sb-1002-internal/lib' -L/home/tester/rtems-cron-6/rtems-source-builder/bare/build/tmp/sb-1002-internal/lib -o libffi.la -rpath /home/tester/rtems-cron-6/tools/6/lib/../lib src/prep_cif.lo src/types.lo src/raw_api.lo src/java_raw_api.lo src/closures.lo src/x86/ffi64.lo src/x86/unix64.lo src/x86/ffi.lo src/x86/sysv.lo
libtool: link: x86_64-linux-gnu-ar cru .libs/libffi_convenience.a src/.libs/prep_cif.o src/.libs/types.o src/.libs/raw_api.o src/.libs/java_raw_api.o src/.libs/closures.o src/x86/.libs/ffi64.o src/x86/.libs/unix64.o src/x86/.libs/ffi.o src/x86/.libs/sysv.o
x86_64-linux-gnu-ar: `u' modifier ignored since `D' is the default (see `U')
libtool: link: gcc -O2 -g -pipe -I/home/tester/rtems-cron-6/rtems-source-builder/bare/build/tmp/sb-1002/devel/qemu/home/tester/rtems-cron-6/tools/6/include -I/home/tester/rtems-cron-6/rtems-source-builder/bare/build/tmp/sb-1002-internal/include -shared -fPIC -DPIC src/.libs/prep_cif.o src/.libs/types.o src/.libs/raw_api.o src/.libs/java_raw_api.o src/.libs/closures.o src/x86/.libs/ffi64.o src/x86/.libs/unix64.o src/x86/.libs/ffi.o src/x86/.libs/sysv.o -L/home/tester/rtems-cron-6/rtems-source-builder/bare/build/tmp/sb-1002-internal/lib -O2 -O3 -march=core2 -Wl,-soname -Wl,libffi.so.6 -o .libs/libffi.so.6.0.1
libtool: link: x86_64-linux-gnu-ranlib .libs/libffi_convenience.a
libtool: link: ( cd ".libs" && rm -f "libffi_convenience.la" && ln -s "../libffi_convenience.la" "libffi_convenience.la" )
libtool: link: (cd ".libs" && rm -f "libffi.so.6" && ln -s "libffi.so.6.0.1" "libffi.so.6")
libtool: link: (cd ".libs" && rm -f "libffi.so" && ln -s "libffi.so.6.0.1" "libffi.so")
libtool: link: x86_64-linux-gnu-ar cru .libs/libffi.a src/prep_cif.o src/types.o src/raw_api.o src/java_raw_api.o src/closures.o src/x86/ffi64.o src/x86/unix64.o src/x86/ffi.o src/x86/sysv.o
x86_64-linux-gnu-ar: `u' modifier ignored since `D' is the default (see `U')
libtool: link: x86_64-linux-gnu-ranlib .libs/libffi.a
libtool: link: ( cd ".libs" && rm -f "libffi.la" && ln -s "../libffi.la" "libffi.la" )
make[2]: Leaving directory '/home/tester/rtems-cron-6/rtems-source-builder/bare/build/libffi-3.0.13-x86_64-linux-gnu-1/build'
make[1]: Leaving directory '/home/tester/rtems-cron-6/rtems-source-builder/bare/build/libffi-3.0.13-x86_64-linux-gnu-1/build'
+ cd /home/tester/rtems-cron-6/rtems-source-builder/bare/build/libffi-3.0.13-x86_64-linux-gnu-1
==> %install:
+ echo ==> %install:
+ pwd
+ build_top=/home/tester/rtems-cron-6/rtems-source-builder/bare/build/libffi-3.0.13-x86_64-linux-gnu-1
+ /bin/rm -rf /home/tester/rtems-cron-6/rtems-source-builder/bare/build/tmp/libffi-3.0.13-x86_64-linux-gnu-1-1002
+ cd build
+ make DESTDIR=/home/tester/rtems-cron-6/rtems-source-builder/bare/build/tmp/libffi-3.0.13-x86_64-linux-gnu-1-1002 install
Making install in include
make[1]: Entering directory '/home/tester/rtems-cron-6/rtems-source-builder/bare/build/libffi-3.0.13-x86_64-linux-gnu-1/build/include'
make[2]: Entering directory '/home/tester/rtems-cron-6/rtems-source-builder/bare/build/libffi-3.0.13-x86_64-linux-gnu-1/build/include'
make[2]: Nothing to be done for 'install-exec-am'.
/usr/bin/mkdir -p '/home/tester/rtems-cron-6/rtems-source-builder/bare/build/tmp/libffi-3.0.13-x86_64-linux-gnu-1-1002/home/tester/rtems-cron-6/tools/6/lib/libffi-3.0.13/include'
/usr/bin/install -c -m 644 ffi.h ffitarget.h '/home/tester/rtems-cron-6/rtems-source-builder/bare/build/tmp/libffi-3.0.13-x86_64-linux-gnu-1-1002/home/tester/rtems-cron-6/tools/6/lib/libffi-3.0.13/include'
make[2]: Leaving directory '/home/tester/rtems-cron-6/rtems-source-builder/bare/build/libffi-3.0.13-x86_64-linux-gnu-1/build/include'
make[1]: Leaving directory '/home/tester/rtems-cron-6/rtems-source-builder/bare/build/libffi-3.0.13-x86_64-linux-gnu-1/build/include'
Making install in testsuite
make[1]: Entering directory '/home/tester/rtems-cron-6/rtems-source-builder/bare/build/libffi-3.0.13-x86_64-linux-gnu-1/build/testsuite'
make[2]: Entering directory '/home/tester/rtems-cron-6/rtems-source-builder/bare/build/libffi-3.0.13-x86_64-linux-gnu-1/build/testsuite'
make[2]: Nothing to be done for 'install-exec-am'.
make[2]: Nothing to be done for 'install-data-am'.
make[2]: Leaving directory '/home/tester/rtems-cron-6/rtems-source-builder/bare/build/libffi-3.0.13-x86_64-linux-gnu-1/build/testsuite'
make[1]: Leaving directory '/home/tester/rtems-cron-6/rtems-source-builder/bare/build/libffi-3.0.13-x86_64-linux-gnu-1/build/testsuite'
Making install in man
make[1]: Entering directory '/home/tester/rtems-cron-6/rtems-source-builder/bare/build/libffi-3.0.13-x86_64-linux-gnu-1/build/man'
make[2]: Entering directory '/home/tester/rtems-cron-6/rtems-source-builder/bare/build/libffi-3.0.13-x86_64-linux-gnu-1/build/man'
make[2]: Nothing to be done for 'install-exec-am'.
/usr/bin/mkdir -p '/home/tester/rtems-cron-6/rtems-source-builder/bare/build/tmp/libffi-3.0.13-x86_64-linux-gnu-1-1002/home/tester/rtems-cron-6/tools/6/share/man/man3'
/usr/bin/install -c -m 644 ../../libffi-3.0.13/man/ffi.3 ../../libffi-3.0.13/man/ffi_call.3 ../../libffi-3.0.13/man/ffi_prep_cif.3 ../../libffi-3.0.13/man/ffi_prep_cif_var.3 '/home/tester/rtems-cron-6/rtems-source-builder/bare/build/tmp/libffi-3.0.13-x86_64-linux-gnu-1-1002/home/tester/rtems-cron-6/tools/6/share/man/man3'
make[2]: Leaving directory '/home/tester/rtems-cron-6/rtems-source-builder/bare/build/libffi-3.0.13-x86_64-linux-gnu-1/build/man'
make[1]: Leaving directory '/home/tester/rtems-cron-6/rtems-source-builder/bare/build/libffi-3.0.13-x86_64-linux-gnu-1/build/man'
make[1]: Entering directory '/home/tester/rtems-cron-6/rtems-source-builder/bare/build/libffi-3.0.13-x86_64-linux-gnu-1/build'
make[2]: Entering directory '/home/tester/rtems-cron-6/rtems-source-builder/bare/build/libffi-3.0.13-x86_64-linux-gnu-1/build'
/usr/bin/mkdir -p '/home/tester/rtems-cron-6/rtems-source-builder/bare/build/tmp/libffi-3.0.13-x86_64-linux-gnu-1-1002/home/tester/rtems-cron-6/tools/6/lib/../lib'
/bin/bash ./libtool --mode=install /usr/bin/install -c libffi.la '/home/tester/rtems-cron-6/rtems-source-builder/bare/build/tmp/libffi-3.0.13-x86_64-linux-gnu-1-1002/home/tester/rtems-cron-6/tools/6/lib/../lib'
libtool: install: /usr/bin/install -c .libs/libffi.so.6.0.1 /home/tester/rtems-cron-6/rtems-source-builder/bare/build/tmp/libffi-3.0.13-x86_64-linux-gnu-1-1002/home/tester/rtems-cron-6/tools/6/lib/../lib/libffi.so.6.0.1
libtool: install: (cd /home/tester/rtems-cron-6/rtems-source-builder/bare/build/tmp/libffi-3.0.13-x86_64-linux-gnu-1-1002/home/tester/rtems-cron-6/tools/6/lib/../lib && { ln -s -f libffi.so.6.0.1 libffi.so.6 || { rm -f libffi.so.6 && ln -s libffi.so.6.0.1 libffi.so.6; }; })
libtool: install: (cd /home/tester/rtems-cron-6/rtems-source-builder/bare/build/tmp/libffi-3.0.13-x86_64-linux-gnu-1-1002/home/tester/rtems-cron-6/tools/6/lib/../lib && { ln -s -f libffi.so.6.0.1 libffi.so || { rm -f libffi.so && ln -s libffi.so.6.0.1 libffi.so; }; })
libtool: install: /usr/bin/install -c .libs/libffi.lai /home/tester/rtems-cron-6/rtems-source-builder/bare/build/tmp/libffi-3.0.13-x86_64-linux-gnu-1-1002/home/tester/rtems-cron-6/tools/6/lib/../lib/libffi.la
libtool: install: /usr/bin/install -c .libs/libffi.a /home/tester/rtems-cron-6/rtems-source-builder/bare/build/tmp/libffi-3.0.13-x86_64-linux-gnu-1-1002/home/tester/rtems-cron-6/tools/6/lib/../lib/libffi.a
libtool: install: chmod 644 /home/tester/rtems-cron-6/rtems-source-builder/bare/build/tmp/libffi-3.0.13-x86_64-linux-gnu-1-1002/home/tester/rtems-cron-6/tools/6/lib/../lib/libffi.a
libtool: install: x86_64-linux-gnu-ranlib /home/tester/rtems-cron-6/rtems-source-builder/bare/build/tmp/libffi-3.0.13-x86_64-linux-gnu-1-1002/home/tester/rtems-cron-6/tools/6/lib/../lib/libffi.a
libtool: install: warning: remember to run `libtool --finish /home/tester/rtems-cron-6/tools/6/lib/../lib'
/usr/bin/mkdir -p '/home/tester/rtems-cron-6/rtems-source-builder/bare/build/tmp/libffi-3.0.13-x86_64-linux-gnu-1-1002/home/tester/rtems-cron-6/tools/6/share/info'
/usr/bin/install -c -m 644 ../libffi-3.0.13/doc/libffi.info '/home/tester/rtems-cron-6/rtems-source-builder/bare/build/tmp/libffi-3.0.13-x86_64-linux-gnu-1-1002/home/tester/rtems-cron-6/tools/6/share/info'
install-info --info-dir='/home/tester/rtems-cron-6/rtems-source-builder/bare/build/tmp/libffi-3.0.13-x86_64-linux-gnu-1-1002/home/tester/rtems-cron-6/tools/6/share/info' '/home/tester/rtems-cron-6/rtems-source-builder/bare/build/tmp/libffi-3.0.13-x86_64-linux-gnu-1-1002/home/tester/rtems-cron-6/tools/6/share/info/libffi.info'
/usr/bin/mkdir -p '/home/tester/rtems-cron-6/rtems-source-builder/bare/build/tmp/libffi-3.0.13-x86_64-linux-gnu-1-1002/home/tester/rtems-cron-6/tools/6/lib/pkgconfig'
/usr/bin/install -c -m 644 libffi.pc '/home/tester/rtems-cron-6/rtems-source-builder/bare/build/tmp/libffi-3.0.13-x86_64-linux-gnu-1-1002/home/tester/rtems-cron-6/tools/6/lib/pkgconfig'
make[2]: Leaving directory '/home/tester/rtems-cron-6/rtems-source-builder/bare/build/libffi-3.0.13-x86_64-linux-gnu-1/build'
make[1]: Leaving directory '/home/tester/rtems-cron-6/rtems-source-builder/bare/build/libffi-3.0.13-x86_64-linux-gnu-1/build'
+ cd /home/tester/rtems-cron-6/rtems-source-builder/bare/build/libffi-3.0.13-x86_64-linux-gnu-1
sizes: libffi-3.0.13-x86_64-linux-gnu-1: 5.808MB (installed: 453.329KB)
cleaning: libffi-3.0.13-x86_64-linux-gnu-1
run: /bin/sh -ex /home/tester/rtems-cron-6/rtems-source-builder/bare/build/libffi-3.0.13-x86_64-linux-gnu-1/do-clean
+ export SB_ORIG_PATH=/home/tester/rtems-cron-6/tools/6/bin:/usr/local/sbin:/usr/local/bin:/usr/sbin:/usr/bin:/sbin:/bin:/usr/games:/usr/local/games:/snap/bin
+ SB_PREFIX=/home/tester/rtems-cron-6/tools/6
+ echo /home/tester/rtems-cron-6/tools/6
+ /bin/sed -e s/^\///
+ SB_PREFIX_CLEAN=home/tester/rtems-cron-6/tools/6
+ SB_SOURCE_DIR=/home/tester/rtems-cron-6/rtems-source-builder/bare/sources
+ SB_BUILD_DIR=/home/tester/rtems-cron-6/rtems-source-builder/bare/build/libffi-3.0.13-x86_64-linux-gnu-1
+ SB_HOST_CPPFLAGS=
+ SB_TMP_INCLUDES=-I/home/tester/rtems-cron-6/rtems-source-builder/bare/build/tmp/sb-1002/devel/qemu/home/tester/rtems-cron-6/tools/6/include -I/home/tester/rtems-cron-6/rtems-source-builder/bare/build/tmp/sb-1002-internal/include
+ SB_TMP_LDFLAGS=-L/home/tester/rtems-cron-6/rtems-source-builder/bare/build/tmp/sb-1002-internal/lib
+ SB_HOST_CFLAGS=-O2 -g -pipe
+ SB_HOST_CXXFLAGS=-O2 -g -pipe
+ SB_HOST_LDFLAGS= -L/home/tester/rtems-cron-6/rtems-source-builder/bare/build/tmp/sb-1002/devel/qemu/home/tester/rtems-cron-6/tools/6/lib
+ SB_HOST_LIBS=
+ SB_BUILD_CFLAGS=-O2 -g -pipe -I/home/tester/rtems-cron-6/rtems-source-builder/bare/build/tmp/sb-1002/devel/qemu/home/tester/rtems-cron-6/tools/6/include -I/home/tester/rtems-cron-6/rtems-source-builder/bare/build/tmp/sb-1002-internal/include
+ SB_BUILD_CXXFLAGS=-O2 -g -pipe -I/home/tester/rtems-cron-6/rtems-source-builder/bare/build/tmp/sb-1002/devel/qemu/home/tester/rtems-cron-6/tools/6/include -I/home/tester/rtems-cron-6/rtems-source-builder/bare/build/tmp/sb-1002-internal/include
+ SB_BUILD_LDFLAGS= -L/home/tester/rtems-cron-6/rtems-source-builder/bare/build/tmp/sb-1002-internal/lib
+ SB_BUILD_LIBS=
+ SB_CFLAGS=-O2 -g -pipe -I/home/tester/rtems-cron-6/rtems-source-builder/bare/build/tmp/sb-1002/devel/qemu/home/tester/rtems-cron-6/tools/6/include -I/home/tester/rtems-cron-6/rtems-source-builder/bare/build/tmp/sb-1002-internal/include -I/home/tester/rtems-cron-6/rtems-source-builder/bare/build/tmp/sb-1002/devel/qemu/home/tester/rtems-cron-6/tools/6/include -I/home/tester/rtems-cron-6/rtems-source-builder/bare/build/tmp/sb-1002-internal/include
+ SB_CXXFLAGS=-O2 -g -pipe -I/home/tester/rtems-cron-6/rtems-source-builder/bare/build/tmp/sb-1002/devel/qemu/home/tester/rtems-cron-6/tools/6/include -I/home/tester/rtems-cron-6/rtems-source-builder/bare/build/tmp/sb-1002-internal/include -I/home/tester/rtems-cron-6/rtems-source-builder/bare/build/tmp/sb-1002/devel/qemu/home/tester/rtems-cron-6/tools/6/include -I/home/tester/rtems-cron-6/rtems-source-builder/bare/build/tmp/sb-1002-internal/include
+ SB_ARCH=x86_64
+ SB_OS=linux
+ export SB_SOURCE_DIR SB_BUILD_DIR SB_ARCH SB_OS
+ export SB_HOST_CPPFLAGS SB_HOST_CFLAGS SB_HOST_CXXFLAGS SB_HOST_LDFLAGS SB_HOST_LIBS
+ export SB_BUILD_CFLAGS SB_BUILD_CXXFLAGS SB_BUILD_LDFLAGS SB_BUILD_LIBS
+ export SB_CFLAGS SB_CXXFLAGS
+ SB_DOC_DIR=/home/tester/rtems-cron-6/tools/6/share/doc
+ export SB_DOC_DIR
+ SB_PACKAGE_NAME=libffi-3.0.13-x86_64-linux-gnu-1
+ SB_PACKAGE_BUILDNAME=libffi-3.0.13-x86_64-linux-gnu-1
+ SB_PACKAGE_VERSION=3.0.13
+ SB_PACKAGE_RELEASE=1
+ export SB_PACKAGE_NAME SB_PACKAGE_VERSION SB_PACKAGE_RELEASE
+ export SB_PREFIX
+ SB_BUILD_DIR=/home/tester/rtems-cron-6/rtems-source-builder/bare/build/libffi-3.0.13-x86_64-linux-gnu-1
+ SB_BUILD_ROOT=/home/tester/rtems-cron-6/rtems-source-builder/bare/build/tmp/libffi-3.0.13-x86_64-linux-gnu-1-1002
+ SB_BUILD_ROOT_BINDIR=/home/tester/rtems-cron-6/rtems-source-builder/bare/build/tmp/libffi-3.0.13-x86_64-linux-gnu-1-1002/home/tester/rtems-cron-6/tools/6/bin
+ export SB_BUILD_ROOT SB_BUILD_DIR SB_BUILD_ROOT_BINDIR
+ SB_BUILD_CXC_DIR=/home/tester/rtems-cron-6/rtems-source-builder/bare/build/libffi-3.0.13-x86_64-linux-gnu-1-cxc
+ SB_BUILD_CXC_ROOT=/home/tester/rtems-cron-6/rtems-source-builder/bare/build/tmp/libffi-3.0.13-x86_64-linux-gnu-1-1002-cxc
+ SB_BUILD_CXC_ROOT_BINDIR=/home/tester/rtems-cron-6/rtems-source-builder/bare/build/tmp/libffi-3.0.13-x86_64-linux-gnu-1-1002-cxc/home/tester/rtems-cron-6/tools/6/bin
+ export SB_BUILD_CXC_ROOT SB_BUILD_CXC_DIR SB_BUILD_CXC_ROOT_BINDIR
+ SB_TMPROOT=/home/tester/rtems-cron-6/rtems-source-builder/bare/build/tmp/sb-1002/devel/qemu
+ SB_TMPPREFIX=/home/tester/rtems-cron-6/rtems-source-builder/bare/build/tmp/sb-1002/devel/qemu/home/tester/rtems-cron-6/tools/6
+ SB_TMPBINDIR=/home/tester/rtems-cron-6/rtems-source-builder/bare/build/tmp/sb-1002/devel/qemu/home/tester/rtems-cron-6/tools/6/bin
+ export SB_TMPROOT SB_TMPPREFIX SB_TMPBINDIR
+ SB_TMPCXCROOT=/home/tester/rtems-cron-6/rtems-source-builder/bare/build/tmp/sb-1002/devel/qemu
+ SB_TMPCXCPREFIX=/home/tester/rtems-cron-6/rtems-source-builder/bare/build/tmp/sb-1002-cxc/devel/qemu/home/tester/rtems-cron-6/tools/6
+ SB_TMPCXCBINDIR=/home/tester/rtems-cron-6/rtems-source-builder/bare/build/tmp/sb-1002-cxc/devel/qemu/home/tester/rtems-cron-6/tools/6/bin
+ export SB_TMPCXCROOT SB_TMPCXCPREFIX SB_TMPCXCBINDIR
+ SB_EXTRAPATH=/home/tester/rtems-cron-6/rtems-source-builder/source-builder
+ export CFLAGS_FOR_TARGET
+ export CXXFLAGS_FOR_TARGET
+ test -n /home/tester/rtems-cron-6/rtems-source-builder/bare/build/tmp/sb-1002/devel/qemu/home/tester/rtems-cron-6/tools/6/bin
+ PATH=/home/tester/rtems-cron-6/rtems-source-builder/bare/build/tmp/sb-1002/devel/qemu/home/tester/rtems-cron-6/tools/6/bin:/home/tester/rtems-cron-6/tools/6/bin:/usr/local/sbin:/usr/local/bin:/usr/sbin:/usr/bin:/sbin:/bin:/usr/games:/usr/local/games:/snap/bin
+ test -n /home/tester/rtems-cron-6/rtems-source-builder/bare/build/tmp/sb-1002-cxc/devel/qemu/home/tester/rtems-cron-6/tools/6/bin
+ PATH=/home/tester/rtems-cron-6/rtems-source-builder/bare/build/tmp/sb-1002-cxc/devel/qemu/home/tester/rtems-cron-6/tools/6/bin:/home/tester/rtems-cron-6/rtems-source-builder/bare/build/tmp/sb-1002/devel/qemu/home/tester/rtems-cron-6/tools/6/bin:/home/tester/rtems-cron-6/tools/6/bin:/usr/local/sbin:/usr/local/bin:/usr/sbin:/usr/bin:/sbin:/bin:/usr/games:/usr/local/games:/snap/bin
+ test -n /home/tester/rtems-cron-6/rtems-source-builder/source-builder
+ PATH=/home/tester/rtems-cron-6/rtems-source-builder/source-builder:/home/tester/rtems-cron-6/rtems-source-builder/bare/build/tmp/sb-1002-cxc/devel/qemu/home/tester/rtems-cron-6/tools/6/bin:/home/tester/rtems-cron-6/rtems-source-builder/bare/build/tmp/sb-1002/devel/qemu/home/tester/rtems-cron-6/tools/6/bin:/home/tester/rtems-cron-6/tools/6/bin:/usr/local/sbin:/usr/local/bin:/usr/sbin:/usr/bin:/sbin:/bin:/usr/games:/usr/local/games:/snap/bin
=> libffi-3.0.13-x86_64-linux-gnu-1: CLEAN
+ PATH=/home/tester/rtems-cron-6/rtems-source-builder/bare/build/tmp/sb-1002-staging/bin:/home/tester/rtems-cron-6/rtems-source-builder/bare/build/tmp/sb-1002-internal/bin:/home/tester/rtems-cron-6/rtems-source-builder/source-builder:/home/tester/rtems-cron-6/rtems-source-builder/bare/build/tmp/sb-1002-cxc/devel/qemu/home/tester/rtems-cron-6/tools/6/bin:/home/tester/rtems-cron-6/rtems-source-builder/bare/build/tmp/sb-1002/devel/qemu/home/tester/rtems-cron-6/tools/6/bin:/home/tester/rtems-cron-6/tools/6/bin:/usr/local/sbin:/usr/local/bin:/usr/sbin:/usr/bin:/sbin:/bin:/usr/games:/usr/local/games:/snap/bin
+ export PATH
+ LANG=C
+ export LANG
+ unset DISPLAY
+ umask 022
==> %clean:
+ cd /home/tester/rtems-cron-6/rtems-source-builder/bare/build/libffi-3.0.13-x86_64-linux-gnu-1
+ echo => libffi-3.0.13-x86_64-linux-gnu-1: CLEAN
+ echo ==> %clean:
copy: /home/tester/rtems-cron-6/rtems-source-builder/bare/build/tmp/libffi-3.0.13-x86_64-linux-gnu-1-1002 => /home/tester/rtems-cron-6/rtems-source-builder/bare/build/tmp/sb-1002/devel/qemu
reporting: devel/libffi-3.0.13-1.cfg -> libffi-3.0.13-x86_64-linux-gnu-1.txt
prefix: [u'/usr/lib/pkgconfig']
paths: /usr/lib/pkgconfig
loading: libffi
get: requires ()
get: requires.private ()
checking: libffi >= 3
check: libffi not found
making dir: /home/tester/rtems-cron-6/rtems-source-builder/bare/build/tmp/libffi-3.0.13-x86_64-linux-gnu-1-1002/home/tester/rtems-cron-6/tools/6/share/rtems/rsb
prefix: [u'/usr/lib/pkgconfig']
paths: /usr/lib/pkgconfig
loading: libffi
get: requires ()
get: requires.private ()
checking: libffi >= 3
check: libffi not found
reporting: devel/libffi-3.0.13-1.cfg -> libffi-3.0.13-x86_64-linux-gnu-1.xml
prefix: [u'/usr/lib/pkgconfig']
paths: /usr/lib/pkgconfig
loading: libffi
get: requires ()
get: requires.private ()
checking: libffi >= 3
check: libffi not found
making dir: /home/tester/rtems-cron-6/rtems-source-builder/bare/build/tmp/libffi-3.0.13-x86_64-linux-gnu-1-1002/home/tester/rtems-cron-6/tools/6/share/rtems/rsb
prefix: [u'/usr/lib/pkgconfig']
paths: /usr/lib/pkgconfig
loading: libffi
get: requires ()
get: requires.private ()
checking: libffi >= 3
check: libffi not found
config: devel/pixman-0.42.2.cfg
prefix: [u'/usr/lib/pkgconfig']
paths: /usr/lib/pkgconfig
loading: pixman-1
get: requires ()
get: requires.private ()
checking: pixman-1 >= 0
check: pixman-1 not found
package: pixman-0.42.2-x86_64-linux-gnu-1
script: 1: #!/bin/sh
script: 2: # ___build_pre as set up in defaults.py
script: 3: # Save the original path away.
script: 4: export SB_ORIG_PATH=${PATH}
script: 5: # Directories
script: 6: SB_PREFIX="/home/tester/rtems-cron-6/tools/6"
script: 7: SB_PREFIX_CLEAN=$(echo "/home/tester/rtems-cron-6/tools/6" | /bin/sed -e 's/^\///')
script: 8: SB_SOURCE_DIR="/home/tester/rtems-cron-6/rtems-source-builder/bare/sources"
script: 9: SB_BUILD_DIR="/home/tester/rtems-cron-6/rtems-source-builder/bare/build/pixman-0.42.2-x86_64-linux-gnu-1"
script: 10: # host == build, use build; host != build, host uses host and build uses build
script: 11: SB_HOST_CPPFLAGS=""
script: 12: # Optional tmpinternal paths
script: 13: SB_TMP_INCLUDES="-I/home/tester/rtems-cron-6/rtems-source-builder/bare/build/tmp/sb-1002/devel/qemu/${SB_PREFIX_CLEAN}/include -I/home/tester/rtems-cron-6/rtems-source-builder/bare/build/tmp/sb-1002-internal/include"
script: 14: SB_TMP_LDFLAGS="-L/home/tester/rtems-cron-6/rtems-source-builder/bare/build/tmp/sb-1002-internal/lib"
script: 15: # Optionally do not add includes to c/cxx flags as newer configure's complain
script: 16: SB_HOST_CFLAGS="-O2 -g -pipe "
script: 17: SB_HOST_CXXFLAGS="-O2 -g -pipe "
script: 18: SB_HOST_LDFLAGS=" -L/home/tester/rtems-cron-6/rtems-source-builder/bare/build/tmp/sb-1002/devel/qemu/${SB_PREFIX_CLEAN}/lib"
script: 19: SB_HOST_LIBS=""
script: 20: SB_BUILD_CFLAGS="-O2 -g -pipe $SB_TMP_INCLUDES"
script: 21: SB_BUILD_CXXFLAGS="-O2 -g -pipe $SB_TMP_INCLUDES"
script: 22: SB_BUILD_LDFLAGS=" $SB_TMP_LDFLAGS"
script: 23: SB_BUILD_LIBS=""
script: 24: SB_CFLAGS="${SB_BUILD_CFLAGS} $SB_TMP_INCLUDES"
script: 25: SB_CXXFLAGS="${SB_BUILD_CXXFLAGS} $SB_TMP_INCLUDES"
script: 26: SB_ARCH="x86_64"
script: 27: SB_OS="linux"
script: 28: export SB_SOURCE_DIR SB_BUILD_DIR SB_ARCH SB_OS
script: 29: export SB_HOST_CPPFLAGS SB_HOST_CFLAGS SB_HOST_CXXFLAGS SB_HOST_LDFLAGS SB_HOST_LIBS
script: 30: export SB_BUILD_CFLAGS SB_BUILD_CXXFLAGS SB_BUILD_LDFLAGS SB_BUILD_LIBS
script: 31: export SB_CFLAGS SB_CXXFLAGS
script: 32: # Documentation
script: 33: SB_DOC_DIR="/home/tester/rtems-cron-6/tools/6/share/doc"
script: 34: export SB_DOC_DIR
script: 35: # Packages
script: 36: SB_PACKAGE_NAME="pixman-0.42.2-x86_64-linux-gnu-1"
script: 37: SB_PACKAGE_BUILDNAME="pixman-0.42.2-x86_64-linux-gnu-1"
script: 38: SB_PACKAGE_VERSION="0.42.2"
script: 39: SB_PACKAGE_RELEASE="1"
script: 40: export SB_PACKAGE_NAME SB_PACKAGE_VERSION SB_PACKAGE_RELEASE
script: 41: # Build directories
script: 42: export SB_PREFIX
script: 43: SB_BUILD_DIR="/home/tester/rtems-cron-6/rtems-source-builder/bare/build/pixman-0.42.2-x86_64-linux-gnu-1"
script: 44: SB_BUILD_ROOT="/home/tester/rtems-cron-6/rtems-source-builder/bare/build/tmp/pixman-0.42.2-x86_64-linux-gnu-1-1002"
script: 45: SB_BUILD_ROOT_BINDIR="/home/tester/rtems-cron-6/rtems-source-builder/bare/build/tmp/pixman-0.42.2-x86_64-linux-gnu-1-1002/${SB_PREFIX_CLEAN}/bin"
script: 46: export SB_BUILD_ROOT SB_BUILD_DIR SB_BUILD_ROOT_BINDIR
script: 47: SB_BUILD_CXC_DIR="/home/tester/rtems-cron-6/rtems-source-builder/bare/build/pixman-0.42.2-x86_64-linux-gnu-1-cxc"
script: 48: SB_BUILD_CXC_ROOT="/home/tester/rtems-cron-6/rtems-source-builder/bare/build/tmp/pixman-0.42.2-x86_64-linux-gnu-1-1002-cxc"
script: 49: SB_BUILD_CXC_ROOT_BINDIR="/home/tester/rtems-cron-6/rtems-source-builder/bare/build/tmp/pixman-0.42.2-x86_64-linux-gnu-1-1002-cxc/${SB_PREFIX_CLEAN}/bin"
script: 50: export SB_BUILD_CXC_ROOT SB_BUILD_CXC_DIR SB_BUILD_CXC_ROOT_BINDIR
script: 51: SB_TMPROOT="/home/tester/rtems-cron-6/rtems-source-builder/bare/build/tmp/sb-1002/devel/qemu"
script: 52: SB_TMPPREFIX="/home/tester/rtems-cron-6/rtems-source-builder/bare/build/tmp/sb-1002/devel/qemu/${SB_PREFIX_CLEAN}"
script: 53: SB_TMPBINDIR="/home/tester/rtems-cron-6/rtems-source-builder/bare/build/tmp/sb-1002/devel/qemu/${SB_PREFIX_CLEAN}/bin"
script: 54: export SB_TMPROOT SB_TMPPREFIX SB_TMPBINDIR
script: 55: SB_TMPCXCROOT="/home/tester/rtems-cron-6/rtems-source-builder/bare/build/tmp/sb-1002/devel/qemu"
script: 56: SB_TMPCXCPREFIX="/home/tester/rtems-cron-6/rtems-source-builder/bare/build/tmp/sb-1002-cxc/devel/qemu/${SB_PREFIX_CLEAN}"
script: 57: SB_TMPCXCBINDIR="/home/tester/rtems-cron-6/rtems-source-builder/bare/build/tmp/sb-1002-cxc/devel/qemu/${SB_PREFIX_CLEAN}/bin"
script: 58: export SB_TMPCXCROOT SB_TMPCXCPREFIX SB_TMPCXCBINDIR
script: 59: # Extra path support
script: 60: SB_EXTRAPATH="/home/tester/rtems-cron-6/rtems-source-builder/source-builder"
script: 61: # The compiler flags
script: 62:
script: 63:
script: 64: export CFLAGS_FOR_TARGET
script: 65: export CXXFLAGS_FOR_TARGET
script: 66: # Set up the path. Put the CXC path first.
script: 67: if test -n "${SB_TMPBINDIR}" ; then
script: 68: PATH="${SB_TMPBINDIR}:$PATH"
script: 69: fi
script: 70: if test -n "${SB_TMPCXCBINDIR}" ; then
script: 71: PATH="${SB_TMPCXCBINDIR}:$PATH"
script: 72: fi
script: 73: if test -n "${SB_EXTRAPATH}" ; then
script: 74: PATH="${SB_EXTRAPATH}:$PATH"
script: 75: fi
script: 76: PATH="/home/tester/rtems-cron-6/rtems-source-builder/bare/build/tmp/sb-1002-staging/bin:/home/tester/rtems-cron-6/rtems-source-builder/bare/build/tmp/sb-1002-internal/bin:$PATH"
script: 77:
script: 78: export PATH
script: 79: # Default environment set up.
script: 80: LANG=C
script: 81: export LANG
script: 82: unset DISPLAY || :
script: 83: umask 022
script: 84: cd "/home/tester/rtems-cron-6/rtems-source-builder/bare/build/pixman-0.42.2-x86_64-linux-gnu-1"
script: 85: echo "=> pixman-0.42.2-x86_64-linux-gnu-1: BUILD"
script: 86: echo "==> %prep:"
script: 87: build_top=$(pwd)
script: 88: source_dir_pixman="pixman-0.42.2"
source setup: pixman-0.42.2-x86_64-linux-gnu-1: source pixman -q -n pixman-0.42.2
making dir: /home/tester/rtems-cron-6/rtems-source-builder/bare/sources
download: (full) http://cairographics.org/releases/pixman-0.42.2.tar.gz -> sources/pixman-0.42.2.tar.gz
download: http://cairographics.org/releases/pixman-0.42.2.tar.gz -> sources/pixman-0.42.2.tar.gz
download: no ssl context
download: http://cairographics.org/releases/pixman-0.42.2.tar.gz: error: <urlopen error [Errno 111] Connection refused>
error: downloading http://cairographics.org/releases/pixman-0.42.2.tar.gz: all paths have failed, giving up
See error report: rsb-report-pixman-0.42.2-x86_64-linux-gnu-1.txt
Note: In some cases the error appears only in
the complete build log (see --log option)
- - - - - - - - - - - - - - - - - - - - - - - - - - - - - - - - - - - - - - - -
Output
======
Build Set: devel/qemu
Build Set: devel/autotools-internal.bset
config: devel/autoconf-2.69-1.cfg
package: autoconf-2.69-x86_64-linux-gnu-1
download: https://ftp.gnu.org/gnu/autoconf/autoconf-2.69.tar.gz -> sources/autoconf-2.69.tar.gz
building: autoconf-2.69-x86_64-linux-gnu-1
sizes: autoconf-2.69-x86_64-linux-gnu-1: 7.498MB (installed: 0.000B)
cleaning: autoconf-2.69-x86_64-linux-gnu-1
config: devel/automake-1.12.6-1.cfg
package: automake-1.12.6-x86_64-linux-gnu-1
download: https://ftp.gnu.org/gnu/automake/automake-1.12.6.tar.gz -> sources/automake-1.12.6.tar.gz
download: https://gitlab.rtems.org/rtems/rtos/rtems/-/blob/main/assets/tracmigration/ticket_atta...<see log> -> patches/automake-1.12.6-bugzilla.redhat.com-1239379.diff
building: automake-1.12.6-x86_64-linux-gnu-1
sizes: automake-1.12.6-x86_64-linux-gnu-1: 8.102MB (installed: 0.000B)
cleaning: automake-1.12.6-x86_64-linux-gnu-1
config: devel/libtool-2.4.7-1.cfg
package: libtool-2.4.7-x86_64-linux-gnu-1
download: https://ftp.gnu.org/gnu/libtool/libtool-2.4.7.tar.gz -> sources/libtool-2.4.7.tar.gz
building: libtool-2.4.7-x86_64-linux-gnu-1
sizes: libtool-2.4.7-x86_64-linux-gnu-1: 9.744MB (installed: 0.000B)
cleaning: libtool-2.4.7-x86_64-linux-gnu-1
cleaning: autoconf-2.69-x86_64-linux-gnu-1
cleaning: automake-1.12.6-x86_64-linux-gnu-1
cleaning: libtool-2.4.7-x86_64-linux-gnu-1
Build Sizes: usage: 9.744MB total: 6.337MB (sources: 6.317MB, patches: 20.167KB, installed 0.000B)
Build Set: Time 0:00:16.102884
config: devel/libiconv-1.14-1.cfg
config: devel/gettext-0.18.3.1-1.cfg
package: gettext-0.18.3.1-x86_64-linux-gnu-1
download: http://ftp.gnu.org/pub/gnu/gettext/gettext-0.18.3.1.tar.gz -> sources/gettext-0.18.3.1.tar.gz
building: gettext-0.18.3.1-x86_64-linux-gnu-1
sizes: gettext-0.18.3.1-x86_64-linux-gnu-1: 163.792MB (installed: 20.422MB)
cleaning: gettext-0.18.3.1-x86_64-linux-gnu-1
reporting: devel/gettext-0.18.3.1-1.cfg -> gettext-0.18.3.1-x86_64-linux-gnu-1.txt
reporting: devel/gettext-0.18.3.1-1.cfg -> gettext-0.18.3.1-x86_64-linux-gnu-1.xml
config: devel/libffi-3.0.13-1.cfg
package: libffi-3.0.13-x86_64-linux-gnu-1
download: https://sourceware.org/pub/libffi/libffi-3.0.13.tar.gz -> sources/libffi-3.0.13.tar.gz
download: http://gitlab.rtems.org/rtems/tools/rtems-tools/-/raw/main/tools/libffi/libffi-pkg-con...<see log> -> patches/libffi-pkg-config-lib64-fix.diff
redirect: https://gitlab.rtems.org/rtems/tools/rtems-tools/-/raw/main/tools/libffi/libffi-pkg-co...<see log>
building: libffi-3.0.13-x86_64-linux-gnu-1
sizes: libffi-3.0.13-x86_64-linux-gnu-1: 5.808MB (installed: 453.329KB)
cleaning: libffi-3.0.13-x86_64-linux-gnu-1
reporting: devel/libffi-3.0.13-1.cfg -> libffi-3.0.13-x86_64-linux-gnu-1.txt
reporting: devel/libffi-3.0.13-1.cfg -> libffi-3.0.13-x86_64-linux-gnu-1.xml
config: devel/pixman-0.42.2.cfg
package: pixman-0.42.2-x86_64-linux-gnu-1
download: http://cairographics.org/releases/pixman-0.42.2.tar.gz -> sources/pixman-0.42.2.tar.gz
download: http://cairographics.org/releases/pixman-0.42.2.tar.gz: error: <urlopen error [Errno 111] Connection refused>
error: downloading http://cairographics.org/releases/pixman-0.42.2.tar.gz: all paths have failed, giving up
Build FAILED
See error report: rsb-report-pixman-0.42.2-x86_64-linux-gnu-1.txt
Note: In some cases the error appears only in
the complete build log (see --log option)
error: downloading http://cairographics.org/releases/pixman-0.42.2.tar.gz: all paths have failed, giving up
Mailing report: build at rtems.org
Report
======
==============================================================================
RTEMS Tools Project <users at rtems.org> Wed Apr 2 02:09:48 2025
==============================================================================
Report: devel/gettext-0.18.3.1-1.cfg
------------------------------------------------------------------------------
RTEMS Source Builder Repository Status
Remotes:
[ remotes removed, contact sender for details ]
Status:
Clean
Head:
Commit: edc391f7985dd3f6f18db0c7562963618a31e51b
=-=-=-=-=-=-=-=-=-=-=-=-=-=-=-=-=-=-=-=-=-=-=-=-=-=-=-=-=-=-=-=-=-=-=-=-=-=-=-
Build Set: (1) devel/gettext-0.18.3.1-1.cfg
=-=-=-=-=-=-=-=-=-=-=-=-=-=-=-=-=-=-=-=-=-=-=-=-=-=-=-=-=-=-=-=-=-=-=-=-=-=-=-
Build Set: (2) devel/gettext-0.18.3.1-1.cfg
------------------------------------------------------------------------------
Package: gettext-0.18.3.1-x86_64-linux-gnu-1
Config: devel/gettext-0.18.3.1-1.cfg
Summary:
GetText offers to programmers, translators, and even users, a well
integrated set of tools and documentation.
URL:
http://www.gnu.org/software/gettext/
Version:
0.18.3.1
Release:
1
Sources: 1
1: http://ftp.gnu.org/pub/gnu/gettext/gettext-0.18.3.1.tar.gz
sha256: 0d8f9a33531b77776b3dc473e7940019ca19bfca5b4c06db6e96065eeb07245d
Patches: 0
Preparation:
build_top=$(pwd)
source_dir_gettext="gettext-0.18.3.1"
%setup source gettext -q -n gettext-0.18.3.1
%setup patch gettext -p1
cd ${build_top}
Build:
build_top=$(pwd)
if test "x86_64-linux-gnu" != "x86_64-linux-gnu" ; then
# Cross-build (Xc) if no target or the host and target match.
# Canadian-cross (Cxc) if build, host and target are all different.
if test -z "" -o "x86_64-linux-gnu" == "" ; then
build_dir="build-xc"
else
build_dir="build-cxc"
fi
else
build_dir="build"
fi
mkdir -p ${build_dir}
cd ${build_dir}
# Host and build flags, Cross build if host and build are different and
# Cxc build if target is deifned and also different.
# Note, gcc is not ready to be compiled with -std=gnu99 (this needs to be checked).
if test "x86_64-linux-gnu" != "x86_64-linux-gnu" ; then
# Cross build
CC=$(echo "x86_64-linux-gnu-gcc" | sed -e 's,-std=gnu99 ,,')
CXX=$(echo "x86_64-linux-gnu-g++" | sed -e 's,-std=gnu99 ,,')
CPPFLAGS="${SB_HOST_CPPFLAGS}"
CFLAGS="${SB_HOST_CFLAGS}"
CXXFLAGS="${SB_HOST_CXXFLAGS}"
LDFLAGS="${SB_HOST_LDFLAGS}"
LDLIBS="${SB_HOST_LIBS}"
LIBS="${SB_HOST_LIBS}"
# Host
CPPFLAGS_FOR_HOST="${SB_HOST_CPPFLAGS}"
CFLAGS_FOR_HOST="${SB_HOST_CFLAGS}"
CXXFLAGS_FOR_HOST="${SB_HOST_CXXFLAGS}"
LDFLAGS_FOR_HOST="${SB_HOST_LDFLAGS}"
LDLIBS_FOR_HOST="${SB_HOST_LIBS}"
LIBS_FOR_HOST="${SB_HOST_LIBS}"
CXXFLAGS_FOR_HOST="${SB_HOST_CFLAGS}"
CC_FOR_HOST=$(echo "gcc ${SB_HOST_CFLAGS}" | sed -e 's,-std=gnu99 ,,')
CXX_FOR_HOST=$(echo "g++ ${SB_HOST_CXXFLAGS}" | sed -e 's,-std=gnu99 ,,')
# Build
CFLAGS_FOR_BUILD="${SB_BUILD_CFLAGS}"
CXXFLAGS_FOR_BUILD="${SB_BUILD_CXXFLAGS}"
LDFLAGS_FOR_BUILD="${SB_BUILD_LDFLAGS}"
LDLIBS_FOR_BUILD="${SB_BUILD_LIBS}"
LIBS_FOR_BUILD="${SB_BUILD_LIBS}"
CXXFLAGS_FOR_BUILD="${SB_BUILD_CFLAGS}"
CC_FOR_BUILD=$(echo "gcc ${SB_BUILD_CFLAGS}" | sed -e 's,-std=gnu99 ,,')
CXX_FOR_BUILD=$(echo "g++ ${SB_BUILD_CXXFLAGS}" | sed -e 's,-std=gnu99 ,,')
else
LDFLAGS="${SB_BUILD_LDFLAGS}"
LDLIBS="${SB_BUILD_LIBS}"
LIBS="${SB_BUILD_LIBS}"
CC=$(echo "gcc ${SB_BUILD_CFLAGS}" | sed -e 's,-std=gnu99 ,,')
CXX=$(echo "g++ ${SB_BUILD_CXXFLAGS}" | sed -e 's,-std=gnu99 ,,')
CC_FOR_BUILD=${CC}
CXX_FOR_BUILD=${CXX}
fi
export CC CXX CPPFLAGS CFLAGS CXXFLAGS LDFLAGS LIBS LDLIBS
export CC_FOR_HOST CXX_FOR_HOST CPPFLAGS_FOR_HOST CFLAGS_FOR_HOST CXXFLAGS_FOR_HOST LDFLAGS_FOR_HOST LDLIBS_FOR_HOST LIBS_FOR_HOST
export CC_FOR_BUILD CXX_FOR_BUILD CFLAGS_FOR_BUILD CXXFLAGS_FOR_BUILD LDFLAGS_FOR_BUILD LDLIBS_FOR_BUILS LIBS_FOR_BUILS
../${source_dir_gettext}/configure --prefix=/home/tester/rtems-cron-6/tools/6 --bindir=/home/tester/rtems-cron-6/tools/6/bin --exec_prefix=/home/tester/rtems-cron-6/tools/6 --includedir=/home/tester/rtems-cron-6/tools/6/include --libdir=/home/tester/rtems-cron-6/tools/6/lib --libexecdir=/home/tester/rtems-cron-6/tools/6/libexec --mandir=/home/tester/rtems-cron-6/tools/6/share/man --infodir=/home/tester/rtems-cron-6/tools/6/share/info --datadir=/home/tester/rtems-cron-6/tools/6/share --build=x86_64-linux-gnu --host=x86_64-linux-gnu
make -j 8 all
cd ${build_top}
Install:
build_top=$(pwd)
/bin/rm -rf $SB_BUILD_ROOT
cd ${build_dir}
make DESTDIR=$SB_BUILD_ROOT install
cd ${build_top}
==============================================================================
RTEMS Tools Project <users at rtems.org> Wed Apr 2 02:09:48 2025
==============================================================================
Report: devel/gettext-0.18.3.1-1.cfg
------------------------------------------------------------------------------
RTEMS Source Builder Repository Status
Remotes:
[ remotes removed, contact sender for details ]
Status:
Clean
Head:
Commit: edc391f7985dd3f6f18db0c7562963618a31e51b
=-=-=-=-=-=-=-=-=-=-=-=-=-=-=-=-=-=-=-=-=-=-=-=-=-=-=-=-=-=-=-=-=-=-=-=-=-=-=-
Build Set: (1) devel/gettext-0.18.3.1-1.cfg
=-=-=-=-=-=-=-=-=-=-=-=-=-=-=-=-=-=-=-=-=-=-=-=-=-=-=-=-=-=-=-=-=-=-=-=-=-=-=-
Build Set: (2) devel/gettext-0.18.3.1-1.cfg
------------------------------------------------------------------------------
Package: gettext-0.18.3.1-x86_64-linux-gnu-1
Config: devel/gettext-0.18.3.1-1.cfg
Summary:
GetText offers to programmers, translators, and even users, a well
integrated set of tools and documentation.
URL:
http://www.gnu.org/software/gettext/
Version:
0.18.3.1
Release:
1
Sources: 1
1: http://ftp.gnu.org/pub/gnu/gettext/gettext-0.18.3.1.tar.gz
sha256: 0d8f9a33531b77776b3dc473e7940019ca19bfca5b4c06db6e96065eeb07245d
Patches: 0
Preparation:
build_top=$(pwd)
source_dir_gettext="gettext-0.18.3.1"
%setup source gettext -q -n gettext-0.18.3.1
%setup patch gettext -p1
cd ${build_top}
Build:
build_top=$(pwd)
if test "x86_64-linux-gnu" != "x86_64-linux-gnu" ; then
# Cross-build (Xc) if no target or the host and target match.
# Canadian-cross (Cxc) if build, host and target are all different.
if test -z "" -o "x86_64-linux-gnu" == "" ; then
build_dir="build-xc"
else
build_dir="build-cxc"
fi
else
build_dir="build"
fi
mkdir -p ${build_dir}
cd ${build_dir}
# Host and build flags, Cross build if host and build are different and
# Cxc build if target is deifned and also different.
# Note, gcc is not ready to be compiled with -std=gnu99 (this needs to be checked).
if test "x86_64-linux-gnu" != "x86_64-linux-gnu" ; then
# Cross build
CC=$(echo "x86_64-linux-gnu-gcc" | sed -e 's,-std=gnu99 ,,')
CXX=$(echo "x86_64-linux-gnu-g++" | sed -e 's,-std=gnu99 ,,')
CPPFLAGS="${SB_HOST_CPPFLAGS}"
CFLAGS="${SB_HOST_CFLAGS}"
CXXFLAGS="${SB_HOST_CXXFLAGS}"
LDFLAGS="${SB_HOST_LDFLAGS}"
LDLIBS="${SB_HOST_LIBS}"
LIBS="${SB_HOST_LIBS}"
# Host
CPPFLAGS_FOR_HOST="${SB_HOST_CPPFLAGS}"
CFLAGS_FOR_HOST="${SB_HOST_CFLAGS}"
CXXFLAGS_FOR_HOST="${SB_HOST_CXXFLAGS}"
LDFLAGS_FOR_HOST="${SB_HOST_LDFLAGS}"
LDLIBS_FOR_HOST="${SB_HOST_LIBS}"
LIBS_FOR_HOST="${SB_HOST_LIBS}"
CXXFLAGS_FOR_HOST="${SB_HOST_CFLAGS}"
CC_FOR_HOST=$(echo "gcc ${SB_HOST_CFLAGS}" | sed -e 's,-std=gnu99 ,,')
CXX_FOR_HOST=$(echo "g++ ${SB_HOST_CXXFLAGS}" | sed -e 's,-std=gnu99 ,,')
# Build
CFLAGS_FOR_BUILD="${SB_BUILD_CFLAGS}"
CXXFLAGS_FOR_BUILD="${SB_BUILD_CXXFLAGS}"
LDFLAGS_FOR_BUILD="${SB_BUILD_LDFLAGS}"
LDLIBS_FOR_BUILD="${SB_BUILD_LIBS}"
LIBS_FOR_BUILD="${SB_BUILD_LIBS}"
CXXFLAGS_FOR_BUILD="${SB_BUILD_CFLAGS}"
CC_FOR_BUILD=$(echo "gcc ${SB_BUILD_CFLAGS}" | sed -e 's,-std=gnu99 ,,')
CXX_FOR_BUILD=$(echo "g++ ${SB_BUILD_CXXFLAGS}" | sed -e 's,-std=gnu99 ,,')
else
LDFLAGS="${SB_BUILD_LDFLAGS}"
LDLIBS="${SB_BUILD_LIBS}"
LIBS="${SB_BUILD_LIBS}"
CC=$(echo "gcc ${SB_BUILD_CFLAGS}" | sed -e 's,-std=gnu99 ,,')
CXX=$(echo "g++ ${SB_BUILD_CXXFLAGS}" | sed -e 's,-std=gnu99 ,,')
CC_FOR_BUILD=${CC}
CXX_FOR_BUILD=${CXX}
fi
export CC CXX CPPFLAGS CFLAGS CXXFLAGS LDFLAGS LIBS LDLIBS
export CC_FOR_HOST CXX_FOR_HOST CPPFLAGS_FOR_HOST CFLAGS_FOR_HOST CXXFLAGS_FOR_HOST LDFLAGS_FOR_HOST LDLIBS_FOR_HOST LIBS_FOR_HOST
export CC_FOR_BUILD CXX_FOR_BUILD CFLAGS_FOR_BUILD CXXFLAGS_FOR_BUILD LDFLAGS_FOR_BUILD LDLIBS_FOR_BUILS LIBS_FOR_BUILS
../${source_dir_gettext}/configure --prefix=/home/tester/rtems-cron-6/tools/6 --bindir=/home/tester/rtems-cron-6/tools/6/bin --exec_prefix=/home/tester/rtems-cron-6/tools/6 --includedir=/home/tester/rtems-cron-6/tools/6/include --libdir=/home/tester/rtems-cron-6/tools/6/lib --libexecdir=/home/tester/rtems-cron-6/tools/6/libexec --mandir=/home/tester/rtems-cron-6/tools/6/share/man --infodir=/home/tester/rtems-cron-6/tools/6/share/info --datadir=/home/tester/rtems-cron-6/tools/6/share --build=x86_64-linux-gnu --host=x86_64-linux-gnu
make -j 8 all
cd ${build_top}
Install:
build_top=$(pwd)
/bin/rm -rf $SB_BUILD_ROOT
cd ${build_dir}
make DESTDIR=$SB_BUILD_ROOT install
cd ${build_top}
==============================================================================
RTEMS Tools Project <users at rtems.org> Wed Apr 2 02:09:53 2025
==============================================================================
Report: devel/libffi-3.0.13-1.cfg
------------------------------------------------------------------------------
RTEMS Source Builder Repository Status
Remotes:
[ remotes removed, contact sender for details ]
Status:
Clean
Head:
Commit: edc391f7985dd3f6f18db0c7562963618a31e51b
=-=-=-=-=-=-=-=-=-=-=-=-=-=-=-=-=-=-=-=-=-=-=-=-=-=-=-=-=-=-=-=-=-=-=-=-=-=-=-
Build Set: (1) devel/libffi-3.0.13-1.cfg
=-=-=-=-=-=-=-=-=-=-=-=-=-=-=-=-=-=-=-=-=-=-=-=-=-=-=-=-=-=-=-=-=-=-=-=-=-=-=-
Build Set: (2) devel/libffi-3.0.13-1.cfg
------------------------------------------------------------------------------
Package: libffi-3.0.13-x86_64-linux-gnu-1
Config: devel/libffi-3.0.13-1.cfg
Summary:
LibFFI provides a portable, high level programming interface to
various calling conventions.
URL:
https://sourceware.org/libffi/
Version:
3.0.13
Release:
1
Sources: 1
1: https://sourceware.org/pub/libffi/libffi-3.0.13.tar.gz
sha256: 1dddde1400c3bcb7749d398071af88c3e4754058d2d4c0b3696c2f82dc5cf11c
Patches: 1
1: http://gitlab.rtems.org/rtems/tools/rtems-tools/-/raw/main/tools/libffi/libffi-pkg-config-lib64-fix.diff
sha256: f858658b7b57db13002987b7d6bb0293f181519032bf4dd36969ccb79d6b16a3
Preparation:
build_top=$(pwd)
source_dir_libffi="libffi-3.0.13"
%setup source libffi -q -n libffi-3.0.13
%setup patch libffi -p1
cd ${build_top}
Build:
build_top=$(pwd)
if test "x86_64-linux-gnu" != "x86_64-linux-gnu" ; then
# Cross-build (Xc) if no target or the host and target match.
# Canadian-cross (Cxc) if build, host and target are all different.
if test -z "" -o "x86_64-linux-gnu" == "" ; then
build_dir="build-xc"
else
build_dir="build-cxc"
fi
else
build_dir="build"
fi
mkdir -p ${build_dir}
cd ${build_dir}
# Host and build flags, Cross build if host and build are different and
# Cxc build if target is deifned and also different.
# Note, gcc is not ready to be compiled with -std=gnu99 (this needs to be checked).
if test "x86_64-linux-gnu" != "x86_64-linux-gnu" ; then
# Cross build
CC=$(echo "x86_64-linux-gnu-gcc" | sed -e 's,-std=gnu99 ,,')
CXX=$(echo "x86_64-linux-gnu-g++" | sed -e 's,-std=gnu99 ,,')
CPPFLAGS="${SB_HOST_CPPFLAGS}"
CFLAGS="${SB_HOST_CFLAGS}"
CXXFLAGS="${SB_HOST_CXXFLAGS}"
LDFLAGS="${SB_HOST_LDFLAGS}"
LDLIBS="${SB_HOST_LIBS}"
LIBS="${SB_HOST_LIBS}"
# Host
CPPFLAGS_FOR_HOST="${SB_HOST_CPPFLAGS}"
CFLAGS_FOR_HOST="${SB_HOST_CFLAGS}"
CXXFLAGS_FOR_HOST="${SB_HOST_CXXFLAGS}"
LDFLAGS_FOR_HOST="${SB_HOST_LDFLAGS}"
LDLIBS_FOR_HOST="${SB_HOST_LIBS}"
LIBS_FOR_HOST="${SB_HOST_LIBS}"
CXXFLAGS_FOR_HOST="${SB_HOST_CFLAGS}"
CC_FOR_HOST=$(echo "gcc ${SB_HOST_CFLAGS}" | sed -e 's,-std=gnu99 ,,')
CXX_FOR_HOST=$(echo "g++ ${SB_HOST_CXXFLAGS}" | sed -e 's,-std=gnu99 ,,')
# Build
CFLAGS_FOR_BUILD="${SB_BUILD_CFLAGS}"
CXXFLAGS_FOR_BUILD="${SB_BUILD_CXXFLAGS}"
LDFLAGS_FOR_BUILD="${SB_BUILD_LDFLAGS}"
LDLIBS_FOR_BUILD="${SB_BUILD_LIBS}"
LIBS_FOR_BUILD="${SB_BUILD_LIBS}"
CXXFLAGS_FOR_BUILD="${SB_BUILD_CFLAGS}"
CC_FOR_BUILD=$(echo "gcc ${SB_BUILD_CFLAGS}" | sed -e 's,-std=gnu99 ,,')
CXX_FOR_BUILD=$(echo "g++ ${SB_BUILD_CXXFLAGS}" | sed -e 's,-std=gnu99 ,,')
else
LDFLAGS="${SB_BUILD_LDFLAGS}"
LDLIBS="${SB_BUILD_LIBS}"
LIBS="${SB_BUILD_LIBS}"
CC=$(echo "gcc ${SB_BUILD_CFLAGS}" | sed -e 's,-std=gnu99 ,,')
CXX=$(echo "g++ ${SB_BUILD_CXXFLAGS}" | sed -e 's,-std=gnu99 ,,')
CC_FOR_BUILD=${CC}
CXX_FOR_BUILD=${CXX}
fi
export CC CXX CPPFLAGS CFLAGS CXXFLAGS LDFLAGS LIBS LDLIBS
export CC_FOR_HOST CXX_FOR_HOST CPPFLAGS_FOR_HOST CFLAGS_FOR_HOST CXXFLAGS_FOR_HOST LDFLAGS_FOR_HOST LDLIBS_FOR_HOST LIBS_FOR_HOST
export CC_FOR_BUILD CXX_FOR_BUILD CFLAGS_FOR_BUILD CXXFLAGS_FOR_BUILD LDFLAGS_FOR_BUILD LDLIBS_FOR_BUILS LIBS_FOR_BUILS
../${source_dir_libffi}/configure --prefix=/home/tester/rtems-cron-6/tools/6 --bindir=/home/tester/rtems-cron-6/tools/6/bin --exec_prefix=/home/tester/rtems-cron-6/tools/6 --includedir=/home/tester/rtems-cron-6/tools/6/include --libdir=/home/tester/rtems-cron-6/tools/6/lib --libexecdir=/home/tester/rtems-cron-6/tools/6/libexec --mandir=/home/tester/rtems-cron-6/tools/6/share/man --infodir=/home/tester/rtems-cron-6/tools/6/share/info --datadir=/home/tester/rtems-cron-6/tools/6/share --build=x86_64-linux-gnu --host=x86_64-linux-gnu
make -j 8 all
cd ${build_top}
Install:
build_top=$(pwd)
/bin/rm -rf $SB_BUILD_ROOT
cd ${build_dir}
make DESTDIR=$SB_BUILD_ROOT install
cd ${build_top}
==============================================================================
RTEMS Tools Project <users at rtems.org> Wed Apr 2 02:09:53 2025
==============================================================================
Report: devel/libffi-3.0.13-1.cfg
------------------------------------------------------------------------------
RTEMS Source Builder Repository Status
Remotes:
[ remotes removed, contact sender for details ]
Status:
Clean
Head:
Commit: edc391f7985dd3f6f18db0c7562963618a31e51b
=-=-=-=-=-=-=-=-=-=-=-=-=-=-=-=-=-=-=-=-=-=-=-=-=-=-=-=-=-=-=-=-=-=-=-=-=-=-=-
Build Set: (1) devel/libffi-3.0.13-1.cfg
=-=-=-=-=-=-=-=-=-=-=-=-=-=-=-=-=-=-=-=-=-=-=-=-=-=-=-=-=-=-=-=-=-=-=-=-=-=-=-
Build Set: (2) devel/libffi-3.0.13-1.cfg
------------------------------------------------------------------------------
Package: libffi-3.0.13-x86_64-linux-gnu-1
Config: devel/libffi-3.0.13-1.cfg
Summary:
LibFFI provides a portable, high level programming interface to
various calling conventions.
URL:
https://sourceware.org/libffi/
Version:
3.0.13
Release:
1
Sources: 1
1: https://sourceware.org/pub/libffi/libffi-3.0.13.tar.gz
sha256: 1dddde1400c3bcb7749d398071af88c3e4754058d2d4c0b3696c2f82dc5cf11c
Patches: 1
1: http://gitlab.rtems.org/rtems/tools/rtems-tools/-/raw/main/tools/libffi/libffi-pkg-config-lib64-fix.diff
sha256: f858658b7b57db13002987b7d6bb0293f181519032bf4dd36969ccb79d6b16a3
Preparation:
build_top=$(pwd)
source_dir_libffi="libffi-3.0.13"
%setup source libffi -q -n libffi-3.0.13
%setup patch libffi -p1
cd ${build_top}
Build:
build_top=$(pwd)
if test "x86_64-linux-gnu" != "x86_64-linux-gnu" ; then
# Cross-build (Xc) if no target or the host and target match.
# Canadian-cross (Cxc) if build, host and target are all different.
if test -z "" -o "x86_64-linux-gnu" == "" ; then
build_dir="build-xc"
else
build_dir="build-cxc"
fi
else
build_dir="build"
fi
mkdir -p ${build_dir}
cd ${build_dir}
# Host and build flags, Cross build if host and build are different and
# Cxc build if target is deifned and also different.
# Note, gcc is not ready to be compiled with -std=gnu99 (this needs to be checked).
if test "x86_64-linux-gnu" != "x86_64-linux-gnu" ; then
# Cross build
CC=$(echo "x86_64-linux-gnu-gcc" | sed -e 's,-std=gnu99 ,,')
CXX=$(echo "x86_64-linux-gnu-g++" | sed -e 's,-std=gnu99 ,,')
CPPFLAGS="${SB_HOST_CPPFLAGS}"
CFLAGS="${SB_HOST_CFLAGS}"
CXXFLAGS="${SB_HOST_CXXFLAGS}"
LDFLAGS="${SB_HOST_LDFLAGS}"
LDLIBS="${SB_HOST_LIBS}"
LIBS="${SB_HOST_LIBS}"
# Host
CPPFLAGS_FOR_HOST="${SB_HOST_CPPFLAGS}"
CFLAGS_FOR_HOST="${SB_HOST_CFLAGS}"
CXXFLAGS_FOR_HOST="${SB_HOST_CXXFLAGS}"
LDFLAGS_FOR_HOST="${SB_HOST_LDFLAGS}"
LDLIBS_FOR_HOST="${SB_HOST_LIBS}"
LIBS_FOR_HOST="${SB_HOST_LIBS}"
CXXFLAGS_FOR_HOST="${SB_HOST_CFLAGS}"
CC_FOR_HOST=$(echo "gcc ${SB_HOST_CFLAGS}" | sed -e 's,-std=gnu99 ,,')
CXX_FOR_HOST=$(echo "g++ ${SB_HOST_CXXFLAGS}" | sed -e 's,-std=gnu99 ,,')
# Build
CFLAGS_FOR_BUILD="${SB_BUILD_CFLAGS}"
CXXFLAGS_FOR_BUILD="${SB_BUILD_CXXFLAGS}"
LDFLAGS_FOR_BUILD="${SB_BUILD_LDFLAGS}"
LDLIBS_FOR_BUILD="${SB_BUILD_LIBS}"
LIBS_FOR_BUILD="${SB_BUILD_LIBS}"
CXXFLAGS_FOR_BUILD="${SB_BUILD_CFLAGS}"
CC_FOR_BUILD=$(echo "gcc ${SB_BUILD_CFLAGS}" | sed -e 's,-std=gnu99 ,,')
CXX_FOR_BUILD=$(echo "g++ ${SB_BUILD_CXXFLAGS}" | sed -e 's,-std=gnu99 ,,')
else
LDFLAGS="${SB_BUILD_LDFLAGS}"
LDLIBS="${SB_BUILD_LIBS}"
LIBS="${SB_BUILD_LIBS}"
CC=$(echo "gcc ${SB_BUILD_CFLAGS}" | sed -e 's,-std=gnu99 ,,')
CXX=$(echo "g++ ${SB_BUILD_CXXFLAGS}" | sed -e 's,-std=gnu99 ,,')
CC_FOR_BUILD=${CC}
CXX_FOR_BUILD=${CXX}
fi
export CC CXX CPPFLAGS CFLAGS CXXFLAGS LDFLAGS LIBS LDLIBS
export CC_FOR_HOST CXX_FOR_HOST CPPFLAGS_FOR_HOST CFLAGS_FOR_HOST CXXFLAGS_FOR_HOST LDFLAGS_FOR_HOST LDLIBS_FOR_HOST LIBS_FOR_HOST
export CC_FOR_BUILD CXX_FOR_BUILD CFLAGS_FOR_BUILD CXXFLAGS_FOR_BUILD LDFLAGS_FOR_BUILD LDLIBS_FOR_BUILS LIBS_FOR_BUILS
../${source_dir_libffi}/configure --prefix=/home/tester/rtems-cron-6/tools/6 --bindir=/home/tester/rtems-cron-6/tools/6/bin --exec_prefix=/home/tester/rtems-cron-6/tools/6 --includedir=/home/tester/rtems-cron-6/tools/6/include --libdir=/home/tester/rtems-cron-6/tools/6/lib --libexecdir=/home/tester/rtems-cron-6/tools/6/libexec --mandir=/home/tester/rtems-cron-6/tools/6/share/man --infodir=/home/tester/rtems-cron-6/tools/6/share/info --datadir=/home/tester/rtems-cron-6/tools/6/share --build=x86_64-linux-gnu --host=x86_64-linux-gnu
make -j 8 all
cd ${build_top}
Install:
build_top=$(pwd)
/bin/rm -rf $SB_BUILD_ROOT
cd ${build_dir}
make DESTDIR=$SB_BUILD_ROOT install
cd ${build_top}
More information about the build
mailing list