building rtems error

Hardik Patel patelhardik239 at
Sun Dec 20 05:45:00 UTC 2015

Applying steps for building rtems, when i execute command make as per Beagleboard xM, Beaglebone black and everything else RTEMS on the Beagles , i got error . please give me solution. thank you

|   |
|   |  |   |   |   |   |   |
| Beagleboard xM, Beaglebone black and everything else RTE...Beagleboard xM, Beaglebone black and everything else RTEMS on the BeaglesTweet Tue 22 July 2014 Everything about RTEMS on Beagleboards & Beaglebones Welcome to... |
|  |
| View on www.shrike-systems... | Preview by Yahoo |
|  |
|   |

arm-rtems4.11-gcc -B../../../../../beagleboneblack/lib/ -specs bsp_specs -qrtems -mcpu=cortex-a8 -O2 -g -Wall -Wmissing-prototypes -Wimplicit-function-declaration -Wstrict-prototypes -Wnested-externs    -mcpu=cortex-a8   -o dl01.pre.exe init.o dl-load.o dl-tar.o arm-rtems4.11-nm -g -n dl01.pre.exe > dl01.pre.num
arm-rtems4.11-size dl01.pre.exe
   text       data        bss        dec        hex    filename
 183916       1988    264055236    264241140    fbffff4    dl01.pre.exe
cp dl01.pre.exe dl01.pre.ralf
rm -f dl01.pre.ralf
mv dl01.pre.exe dl01.pre
rtems-syms -e -c "-mcpu=cortex-a8 -O2 -g -Wall -Wmissing-prototypes -Wimplicit-function-declaration -Wstrict-prototypes -Wnested-externs" -o dl-sym.o dl01.pre
: error trying to exec 'arm-rtems4.12-gcc': execvp: No such file or directory
error: compiling wrapper: Compiler error
make[7]: *** [dl-sym.o] Error 10
make[7]: Leaving directory `/home/hp/development/rtems/b-beagle/arm-rtems4.11/c/beagleboneblack/testsuites/libtests/dl01'
make[6]: *** [all] Error 2
make[6]: Leaving directory `/home/hp/development/rtems/b-beagle/arm-rtems4.11/c/beagleboneblack/testsuites/libtests/dl01'
make[5]: *** [all-local] Error 1
make[5]: Leaving directory `/home/hp/development/rtems/b-beagle/arm-rtems4.11/c/beagleboneblack/testsuites/libtests'
make[4]: *** [all] Error 2
make[4]: Leaving directory `/home/hp/development/rtems/b-beagle/arm-rtems4.11/c/beagleboneblack/testsuites/libtests'
make[3]: *** [all-recursive] Error 1
make[3]: Leaving directory `/home/hp/development/rtems/b-beagle/arm-rtems4.11/c/beagleboneblack/testsuites'
make[2]: *** [all-recursive] Error 1
make[2]: Leaving directory `/home/hp/development/rtems/b-beagle/arm-rtems4.11/c/beagleboneblack'
make[1]: *** [all-recursive] Error 1
make[1]: Leaving directory `/home/hp/development/rtems/b-beagle/arm-rtems4.11/c'
make: *** [all-recursive] Error 1
hp at hp:~/development/rtems/b-beagle$ 

-------------- next part --------------
An HTML attachment was scrubbed...
URL: <>

More information about the users mailing list