Build FreeBSD: FAILED next/rtems-microblaze on x86_64-freebsd15.0 (microblaze-rtems7-gdb-16.1-x86_64-freebsd15.0-1)
OAR Tester for FreeBSD 15
rtems-tester at oarcorp.com
Wed Sep 30 19:25:15 UTC 2026
RTEMS Source Builder - Set Builder, 7.not_released
Host: FreeBSD-15.0-RELEASE-p13-amd64-64bit-ELF
FreeBSD FreeBSD15-VM 15.0-RELEASE-p13 FreeBSD 15.0-RELEASE-p13
releng/15.0-n281114-af58d0db156a GENERIC amd64 amd64
Build Time: 0:04:30.131341
= = = = = = = = = = = = = = = = = = = = = = = = = = = = = = = = = = = = = = = =
Build FAILED: microblaze-rtems7-gdb-16.1-x86_64-freebsd15.0-1
- - - - - - - - - - - - - - - - - - - - - - - - - - - - - - - - - - - - - - - -
script:113: else
script:114: build_dir="build"
script:115: fi
script:116: mkdir -p ${build_dir}
script:117: cd ${build_dir}
script:118: # Host and build flags, Cross build if host and build are different and
script:119: # Cxc build if target is deifned and also different.
script:120: # Note, gcc is not ready to be compiled with -std=gnu99 (this needs to be checked).
script:121: if test "x86_64-freebsd15.0" != "x86_64-freebsd15.0" ; then
script:122: # Cross build
script:123: CC=$(echo "x86_64-freebsd15.0-gcc" | sed -e 's,-std=gnu99 ,,')
script:124: CXX=$(echo "x86_64-freebsd15.0-g++" | sed -e 's,-std=gnu99 ,,')
script:125: CPPFLAGS="${SB_HOST_CPPFLAGS}"
script:126: CFLAGS="${SB_HOST_CFLAGS}"
script:127: CXXFLAGS="${SB_HOST_CXXFLAGS}"
script:128: LDFLAGS="${SB_HOST_LDFLAGS}"
script:129: LDLIBS="${SB_HOST_LIBS}"
script:130: LIBS="${SB_HOST_LIBS}"
script:131: # Host
script:132: CPPFLAGS_FOR_HOST="${SB_HOST_CPPFLAGS}"
script:133: CFLAGS_FOR_HOST="${SB_HOST_CFLAGS}"
script:134: CXXFLAGS_FOR_HOST="${SB_HOST_CXXFLAGS}"
script:135: LDFLAGS_FOR_HOST="${SB_HOST_LDFLAGS}"
script:136: LDLIBS_FOR_HOST="${SB_HOST_LIBS}"
script:137: LIBS_FOR_HOST="${SB_HOST_LIBS}"
script:138: CXXFLAGS_FOR_HOST="${SB_HOST_CFLAGS}"
script:139: CC_FOR_HOST=$(echo "gcc ${SB_HOST_CFLAGS}" | sed -e 's,-std=gnu99 ,,')
script:140: CXX_FOR_HOST=$(echo "g++ ${SB_HOST_CXXFLAGS}" | sed -e 's,-std=gnu99 ,,')
script:141: # Build
script:142: CFLAGS_FOR_BUILD="${SB_BUILD_CFLAGS}"
script:143: CXXFLAGS_FOR_BUILD="${SB_BUILD_CXXFLAGS}"
script:144: LDFLAGS_FOR_BUILD="${SB_BUILD_LDFLAGS}"
script:145: LDLIBS_FOR_BUILD="${SB_BUILD_LIBS}"
script:146: LIBS_FOR_BUILD="${SB_BUILD_LIBS}"
script:147: CXXFLAGS_FOR_BUILD="${SB_BUILD_CFLAGS}"
script:148: CC_FOR_BUILD=$(echo "/usr/bin/cc ${SB_BUILD_CFLAGS}" | sed -e 's,-std=gnu99 ,,')
script:149: CXX_FOR_BUILD=$(echo "/usr/bin/c++ ${SB_BUILD_CXXFLAGS}" | sed -e 's,-std=gnu99 ,,')
script:150: else
script:151: LDFLAGS="${SB_BUILD_LDFLAGS}"
script:152: LDLIBS="${SB_BUILD_LIBS}"
script:153: LIBS="${SB_BUILD_LIBS}"
script:154: CC=$(echo "/usr/bin/cc ${SB_BUILD_CFLAGS}" | sed -e 's,-std=gnu99 ,,')
script:155: CXX=$(echo "/usr/bin/c++ ${SB_BUILD_CXXFLAGS}" | sed -e 's,-std=gnu99 ,,')
script:156: CC_FOR_BUILD=${CC}
script:157: CXX_FOR_BUILD=${CXX}
script:158: fi
script:159: export CC CXX CPPFLAGS CFLAGS CXXFLAGS LDFLAGS LIBS LDLIBS
script:160: export CC_FOR_HOST CXX_FOR_HOST CPPFLAGS_FOR_HOST CFLAGS_FOR_HOST CXXFLAGS_FOR_HOST LDFLAGS_FOR_HOST LDLIBS_FOR_HOST LIBS_FOR_HOST
script:161: export CC_FOR_BUILD CXX_FOR_BUILD CFLAGS_FOR_BUILD CXXFLAGS_FOR_BUILD LDFLAGS_FOR_BUILD LDLIBS_FOR_BUILS LIBS_FOR_BUILS
script:162: if test "x86_64-freebsd15.0" != "x86_64-freebsd15.0" ; then
script:163: GDB_LIBS_STATIC="-lexpat"
script:164: else
script:165: GDB_LIBS_STATIC="-lexpat"
script:166: GDB_LIBS="-Xlinker -Bstatic ${LIBS_STATIC} -Xlinker -Bdynamic"
script:167: fi
script:168: LIBS_STATIC=${GDB_LIBS_STATIC} LIBS=${GDB_LIBS} ../${source_dir_gdb}/configure --build=x86_64-freebsd15.0 --host=x86_64-freebsd15.0 --target=microblaze-rtems7 --verbose --disable-nls --disable-gas --disable-binutils --disable-ld --disable-gold --disable-gprof --without-included-gettext --disable-win32-registry --disable-werror --enable-sim --without-zlib --with-expat --with-guile=no --with-libiconv-prefix=/usr/local --with-python=/usr/local/bin/python3 --prefix=/home/tester/rtems-cron-next/tools/7 --bindir=/home/tester/rtems-cron-next/tools/7/bin --exec-prefix=/home/tester/rtems-cron-next/tools/7 --includedir=/home/tester/rtems-cron-next/tools/7/include --libdir=/home/tester/rtems-cron-next/tools/7/lib --mandir=/home/tester/rtems-cron-next/tools/7/share/man --infodir=/home/tester/rtems-cron-next/tools/7/share/info
script:169: gmake -j 6 all V=1
script:170: cd ${build_top}
script:171: echo "==> %install:"
script:172: build_top=$(pwd)
script:173: /bin/rm -rf $SB_BUILD_ROOT
script:174: cd ${build_dir}
script:175: gmake DESTDIR=$SB_BUILD_ROOT install
script:176: /bin/rm -rf $SB_BUILD_ROOT/home/tester/rtems-cron-next/tools/7/share/info/configure.info*
script:177: /bin/rm -f $SB_BUILD_ROOT/home/tester/rtems-cron-next/tools/7/share/info/dir
script:178: touch $SB_BUILD_ROOT/home/tester/rtems-cron-next/tools/7/share/info/dir
script:179: cd ${build_top}
script: 1: #!/bin/sh
script: 2: # ___build_pre as set up in defaults.py
script: 3: # Save the original path away.
script: 4: export SB_ORIG_PATH=${PATH}
script: 5: # Directories
script: 6: SB_PREFIX="/home/tester/rtems-cron-next/tools/7"
script: 7: SB_PREFIX_CLEAN=$(echo "/home/tester/rtems-cron-next/tools/7" | /usr/bin/sed -e 's/^\///')
script: 8: SB_SOURCE_DIR="/home/tester/rtems-cron-next/rtems-source-builder/rtems/sources"
script: 9: SB_BUILD_DIR="/home/tester/rtems-cron-next/rtems-source-builder/rtems/build/microblaze-rtems7-gdb-16.1-x86_64-freebsd15.0-1"
script: 10: # host == build, use build; host != build, host uses host and build uses build
script: 11: SB_HOST_CPPFLAGS="-I/usr/local/include"
script: 12: # Optional tmpinternal paths
script: 13: SB_TMP_INCLUDES="-I/home/tester/rtems-cron-next/rtems-source-builder/rtems/build/tmp/sb-1002/next/rtems-microblaze/${SB_PREFIX_CLEAN}/include -I/home/tester/rtems-cron-next/rtems-source-builder/rtems/build/tmp/sb-1002-internal/include"
script: 14: SB_TMP_LDFLAGS="-L/home/tester/rtems-cron-next/rtems-source-builder/rtems/build/tmp/sb-1002-internal/lib"
script: 15: # Optionally do not add includes to c/cxx flags as newer configure's complain
script: 16: SB_HOST_CFLAGS="-O2 -g -pipe "
script: 17: SB_HOST_CXXFLAGS="-O2 -g -pipe "
script: 18: SB_HOST_LDFLAGS="-L/usr/local/lib -L/home/tester/rtems-cron-next/rtems-source-builder/rtems/build/tmp/sb-1002/next/rtems-microblaze/${SB_PREFIX_CLEAN}/lib"
script: 19: SB_HOST_LIBS=""
script: 20: SB_BUILD_CFLAGS="-O2 -pipe $SB_TMP_INCLUDES"
script: 21: SB_BUILD_CXXFLAGS="-O2 -pipe $SB_TMP_INCLUDES"
script: 22: SB_BUILD_LDFLAGS=" $SB_TMP_LDFLAGS"
script: 23: SB_BUILD_LIBS=""
script: 24: SB_CFLAGS="${SB_BUILD_CFLAGS} $SB_TMP_INCLUDES"
script: 25: SB_CXXFLAGS="${SB_BUILD_CXXFLAGS} $SB_TMP_INCLUDES"
script: 26: SB_ARCH="x86_64"
script: 27: SB_OS="freebsd"
script: 28: export SB_SOURCE_DIR SB_BUILD_DIR SB_ARCH SB_OS
script: 29: export SB_HOST_CPPFLAGS SB_HOST_CFLAGS SB_HOST_CXXFLAGS SB_HOST_LDFLAGS SB_HOST_LIBS
script: 30: export SB_BUILD_CFLAGS SB_BUILD_CXXFLAGS SB_BUILD_LDFLAGS SB_BUILD_LIBS
script: 31: export SB_CFLAGS SB_CXXFLAGS
script: 32: # Documentation
script: 33: SB_DOC_DIR="/home/tester/rtems-cron-next/tools/7/share/doc"
script: 34: export SB_DOC_DIR
script: 35: # Packages
script: 36: SB_PACKAGE_NAME="microblaze-rtems7-gdb-16.1-x86_64-freebsd15.0-1"
script: 37: SB_PACKAGE_BUILDNAME="microblaze-rtems7-gdb-16.1-x86_64-freebsd15.0-1"
script: 38: SB_PACKAGE_VERSION="16.1"
script: 39: SB_PACKAGE_RELEASE="1"
script: 40: export SB_PACKAGE_NAME SB_PACKAGE_VERSION SB_PACKAGE_RELEASE
script: 41: # Build directories
script: 42: export SB_PREFIX
script: 43: SB_BUILD_DIR="/home/tester/rtems-cron-next/rtems-source-builder/rtems/build/microblaze-rtems7-gdb-16.1-x86_64-freebsd15.0-1"
script: 44: SB_BUILD_ROOT="/home/tester/rtems-cron-next/rtems-source-builder/rtems/build/tmp/microblaze-rtems7-gdb-16.1-x86_64-freebsd15.0-1-1002"
script: 45: SB_BUILD_ROOT_BINDIR="/home/tester/rtems-cron-next/rtems-source-builder/rtems/build/tmp/microblaze-rtems7-gdb-16.1-x86_64-freebsd15.0-1-1002/${SB_PREFIX_CLEAN}/bin"
script: 46: export SB_BUILD_ROOT SB_BUILD_DIR SB_BUILD_ROOT_BINDIR
script: 47: SB_BUILD_CXC_DIR="/home/tester/rtems-cron-next/rtems-source-builder/rtems/build/microblaze-rtems7-gdb-16.1-x86_64-freebsd15.0-1-cxc"
script: 48: SB_BUILD_CXC_ROOT="/home/tester/rtems-cron-next/rtems-source-builder/rtems/build/tmp/microblaze-rtems7-gdb-16.1-x86_64-freebsd15.0-1-1002-cxc"
script: 49: SB_BUILD_CXC_ROOT_BINDIR="/home/tester/rtems-cron-next/rtems-source-builder/rtems/build/tmp/microblaze-rtems7-gdb-16.1-x86_64-freebsd15.0-1-1002-cxc/${SB_PREFIX_CLEAN}/bin"
script: 50: export SB_BUILD_CXC_ROOT SB_BUILD_CXC_DIR SB_BUILD_CXC_ROOT_BINDIR
script: 51: SB_TMPROOT="/home/tester/rtems-cron-next/rtems-source-builder/rtems/build/tmp/sb-1002/next/rtems-microblaze"
script: 52: SB_TMPPREFIX="/home/tester/rtems-cron-next/rtems-source-builder/rtems/build/tmp/sb-1002/next/rtems-microblaze/${SB_PREFIX_CLEAN}"
script: 53: SB_TMPBINDIR="/home/tester/rtems-cron-next/rtems-source-builder/rtems/build/tmp/sb-1002/next/rtems-microblaze/${SB_PREFIX_CLEAN}/bin"
script: 54: export SB_TMPROOT SB_TMPPREFIX SB_TMPBINDIR
script: 55: SB_TMPCXCROOT="/home/tester/rtems-cron-next/rtems-source-builder/rtems/build/tmp/sb-1002/next/rtems-microblaze"
script: 56: SB_TMPCXCPREFIX="/home/tester/rtems-cron-next/rtems-source-builder/rtems/build/tmp/sb-1002-cxc/next/rtems-microblaze/${SB_PREFIX_CLEAN}"
script: 57: SB_TMPCXCBINDIR="/home/tester/rtems-cron-next/rtems-source-builder/rtems/build/tmp/sb-1002-cxc/next/rtems-microblaze/${SB_PREFIX_CLEAN}/bin"
script: 58: export SB_TMPCXCROOT SB_TMPCXCPREFIX SB_TMPCXCBINDIR
script: 59: # Extra path support
script: 60: SB_EXTRAPATH="/home/tester/rtems-cron-next/rtems-source-builder/source-builder"
script: 61: # The compiler flags
script: 62:
script: 63:
script: 64: export CFLAGS_FOR_TARGET
script: 65: export CXXFLAGS_FOR_TARGET
script: 66: # Set up the path. Put the CXC path first.
script: 67: if test -n "${SB_TMPBINDIR}" ; then
script: 68: PATH="${SB_TMPBINDIR}:$PATH"
script: 69: fi
script: 70: if test -n "${SB_TMPCXCBINDIR}" ; then
script: 71: PATH="${SB_TMPCXCBINDIR}:$PATH"
script: 72: fi
script: 73: if test -n "${SB_EXTRAPATH}" ; then
script: 74: PATH="${SB_EXTRAPATH}:$PATH"
script: 75: fi
script: 76: PATH="/home/tester/rtems-cron-next/rtems-source-builder/rtems/build/tmp/sb-1002-staging/bin:/home/tester/rtems-cron-next/rtems-source-builder/rtems/build/tmp/sb-1002-internal/bin:$PATH"
script: 77:
script: 78: export PATH
script: 79: # Default environment set up.
script: 80: LANG=C
script: 81: export LANG
script: 82: unset DISPLAY || :
script: 83: umask 022
script: 84: cd "/home/tester/rtems-cron-next/rtems-source-builder/rtems/build/microblaze-rtems7-gdb-16.1-x86_64-freebsd15.0-1"
script: 85: echo "=> microblaze-rtems7-gdb-16.1-x86_64-freebsd15.0-1: CLEAN"
script: 86: echo "==> %clean:"
removing: /home/tester/rtems-cron-next/rtems-source-builder/rtems/build/microblaze-rtems7-gdb-16.1-x86_64-freebsd15.0-1
making dir: /home/tester/rtems-cron-next/rtems-source-builder/rtems/build/microblaze-rtems7-gdb-16.1-x86_64-freebsd15.0-1
write script: /home/tester/rtems-cron-next/rtems-source-builder/rtems/build/microblaze-rtems7-gdb-16.1-x86_64-freebsd15.0-1/do-build
write script: /home/tester/rtems-cron-next/rtems-source-builder/rtems/build/microblaze-rtems7-gdb-16.1-x86_64-freebsd15.0-1/do-clean
building: microblaze-rtems7-gdb-16.1-x86_64-freebsd15.0-1
run: /bin/sh -ex /home/tester/rtems-cron-next/rtems-source-builder/rtems/build/microblaze-rtems7-gdb-16.1-x86_64-freebsd15.0-1/do-build
+ export 'SB_ORIG_PATH=/home/tester/rtems-cron-next/tools/7/bin:/sbin:/bin:/usr/sbin:/usr/bin:/usr/local/sbin:/usr/local/bin:/home/tester/bin'
+ SB_PREFIX=/home/tester/rtems-cron-next/tools/7
+ echo /home/tester/rtems-cron-next/tools/7
+ /usr/bin/sed -e 's/^\///'
+ SB_PREFIX_CLEAN=home/tester/rtems-cron-next/tools/7
+ SB_SOURCE_DIR=/home/tester/rtems-cron-next/rtems-source-builder/rtems/sources
+ SB_BUILD_DIR=/home/tester/rtems-cron-next/rtems-source-builder/rtems/build/microblaze-rtems7-gdb-16.1-x86_64-freebsd15.0-1
+ SB_HOST_CPPFLAGS=-I/usr/local/include
+ SB_TMP_INCLUDES='-I/home/tester/rtems-cron-next/rtems-source-builder/rtems/build/tmp/sb-1002/next/rtems-microblaze/home/tester/rtems-cron-next/tools/7/include -I/home/tester/rtems-cron-next/rtems-source-builder/rtems/build/tmp/sb-1002-internal/include'
+ SB_TMP_LDFLAGS=-L/home/tester/rtems-cron-next/rtems-source-builder/rtems/build/tmp/sb-1002-internal/lib
+ SB_HOST_CFLAGS='-O2 -g -pipe '
+ SB_HOST_CXXFLAGS='-O2 -g -pipe '
+ SB_HOST_LDFLAGS='-L/usr/local/lib -L/home/tester/rtems-cron-next/rtems-source-builder/rtems/build/tmp/sb-1002/next/rtems-microblaze/home/tester/rtems-cron-next/tools/7/lib'
+ SB_HOST_LIBS=''
+ SB_BUILD_CFLAGS='-O2 -pipe -I/home/tester/rtems-cron-next/rtems-source-builder/rtems/build/tmp/sb-1002/next/rtems-microblaze/home/tester/rtems-cron-next/tools/7/include -I/home/tester/rtems-cron-next/rtems-source-builder/rtems/build/tmp/sb-1002-internal/include'
+ SB_BUILD_CXXFLAGS='-O2 -pipe -I/home/tester/rtems-cron-next/rtems-source-builder/rtems/build/tmp/sb-1002/next/rtems-microblaze/home/tester/rtems-cron-next/tools/7/include -I/home/tester/rtems-cron-next/rtems-source-builder/rtems/build/tmp/sb-1002-internal/include'
+ SB_BUILD_LDFLAGS=' -L/home/tester/rtems-cron-next/rtems-source-builder/rtems/build/tmp/sb-1002-internal/lib'
+ SB_BUILD_LIBS=''
+ SB_CFLAGS='-O2 -pipe -I/home/tester/rtems-cron-next/rtems-source-builder/rtems/build/tmp/sb-1002/next/rtems-microblaze/home/tester/rtems-cron-next/tools/7/include -I/home/tester/rtems-cron-next/rtems-source-builder/rtems/build/tmp/sb-1002-internal/include -I/home/tester/rtems-cron-next/rtems-source-builder/rtems/build/tmp/sb-1002/next/rtems-microblaze/home/tester/rtems-cron-next/tools/7/include -I/home/tester/rtems-cron-next/rtems-source-builder/rtems/build/tmp/sb-1002-internal/include'
+ SB_CXXFLAGS='-O2 -pipe -I/home/tester/rtems-cron-next/rtems-source-builder/rtems/build/tmp/sb-1002/next/rtems-microblaze/home/tester/rtems-cron-next/tools/7/include -I/home/tester/rtems-cron-next/rtems-source-builder/rtems/build/tmp/sb-1002-internal/include -I/home/tester/rtems-cron-next/rtems-source-builder/rtems/build/tmp/sb-1002/next/rtems-microblaze/home/tester/rtems-cron-next/tools/7/include -I/home/tester/rtems-cron-next/rtems-source-builder/rtems/build/tmp/sb-1002-internal/include'
+ SB_ARCH=x86_64
+ SB_OS=freebsd
+ export SB_SOURCE_DIR SB_BUILD_DIR SB_ARCH SB_OS
+ export SB_HOST_CPPFLAGS SB_HOST_CFLAGS SB_HOST_CXXFLAGS SB_HOST_LDFLAGS SB_HOST_LIBS
+ export SB_BUILD_CFLAGS SB_BUILD_CXXFLAGS SB_BUILD_LDFLAGS SB_BUILD_LIBS
+ export SB_CFLAGS SB_CXXFLAGS
+ SB_DOC_DIR=/home/tester/rtems-cron-next/tools/7/share/doc
+ export SB_DOC_DIR
+ SB_PACKAGE_NAME=microblaze-rtems7-gdb-16.1-x86_64-freebsd15.0-1
+ SB_PACKAGE_BUILDNAME=microblaze-rtems7-gdb-16.1-x86_64-freebsd15.0-1
+ SB_PACKAGE_VERSION=16.1
+ SB_PACKAGE_RELEASE=1
+ export SB_PACKAGE_NAME SB_PACKAGE_VERSION SB_PACKAGE_RELEASE
+ export SB_PREFIX
+ SB_BUILD_DIR=/home/tester/rtems-cron-next/rtems-source-builder/rtems/build/microblaze-rtems7-gdb-16.1-x86_64-freebsd15.0-1
+ SB_BUILD_ROOT=/home/tester/rtems-cron-next/rtems-source-builder/rtems/build/tmp/microblaze-rtems7-gdb-16.1-x86_64-freebsd15.0-1-1002
+ SB_BUILD_ROOT_BINDIR=/home/tester/rtems-cron-next/rtems-source-builder/rtems/build/tmp/microblaze-rtems7-gdb-16.1-x86_64-freebsd15.0-1-1002/home/tester/rtems-cron-next/tools/7/bin
+ export SB_BUILD_ROOT SB_BUILD_DIR SB_BUILD_ROOT_BINDIR
=> microblaze-rtems7-gdb-16.1-x86_64-freebsd15.0-1: BUILD
+ SB_BUILD_CXC_DIR=/home/tester/rtems-cron-next/rtems-source-builder/rtems/build/microblaze-rtems7-gdb-16.1-x86_64-freebsd15.0-1-cxc
+ SB_BUILD_CXC_ROOT=/home/tester/rtems-cron-next/rtems-source-builder/rtems/build/tmp/microblaze-rtems7-gdb-16.1-x86_64-freebsd15.0-1-1002-cxc
==> %prep:
+ SB_BUILD_CXC_ROOT_BINDIR=/home/tester/rtems-cron-next/rtems-source-builder/rtems/build/tmp/microblaze-rtems7-gdb-16.1-x86_64-freebsd15.0-1-1002-cxc/home/tester/rtems-cron-next/tools/7/bin
+ export SB_BUILD_CXC_ROOT SB_BUILD_CXC_DIR SB_BUILD_CXC_ROOT_BINDIR
+ SB_TMPROOT=/home/tester/rtems-cron-next/rtems-source-builder/rtems/build/tmp/sb-1002/next/rtems-microblaze
+ SB_TMPPREFIX=/home/tester/rtems-cron-next/rtems-source-builder/rtems/build/tmp/sb-1002/next/rtems-microblaze/home/tester/rtems-cron-next/tools/7
+ SB_TMPBINDIR=/home/tester/rtems-cron-next/rtems-source-builder/rtems/build/tmp/sb-1002/next/rtems-microblaze/home/tester/rtems-cron-next/tools/7/bin
+ export SB_TMPROOT SB_TMPPREFIX SB_TMPBINDIR
+ SB_TMPCXCROOT=/home/tester/rtems-cron-next/rtems-source-builder/rtems/build/tmp/sb-1002/next/rtems-microblaze
+ SB_TMPCXCPREFIX=/home/tester/rtems-cron-next/rtems-source-builder/rtems/build/tmp/sb-1002-cxc/next/rtems-microblaze/home/tester/rtems-cron-next/tools/7
+ SB_TMPCXCBINDIR=/home/tester/rtems-cron-next/rtems-source-builder/rtems/build/tmp/sb-1002-cxc/next/rtems-microblaze/home/tester/rtems-cron-next/tools/7/bin
+ export SB_TMPCXCROOT SB_TMPCXCPREFIX SB_TMPCXCBINDIR
+ SB_EXTRAPATH=/home/tester/rtems-cron-next/rtems-source-builder/source-builder
+ export CFLAGS_FOR_TARGET
+ export CXXFLAGS_FOR_TARGET
+ test -n /home/tester/rtems-cron-next/rtems-source-builder/rtems/build/tmp/sb-1002/next/rtems-microblaze/home/tester/rtems-cron-next/tools/7/bin
+ PATH=/home/tester/rtems-cron-next/rtems-source-builder/rtems/build/tmp/sb-1002/next/rtems-microblaze/home/tester/rtems-cron-next/tools/7/bin:/home/tester/rtems-cron-next/tools/7/bin:/sbin:/bin:/usr/sbin:/usr/bin:/usr/local/sbin:/usr/local/bin:/home/tester/bin
+ test -n /home/tester/rtems-cron-next/rtems-source-builder/rtems/build/tmp/sb-1002-cxc/next/rtems-microblaze/home/tester/rtems-cron-next/tools/7/bin
+ PATH=/home/tester/rtems-cron-next/rtems-source-builder/rtems/build/tmp/sb-1002-cxc/next/rtems-microblaze/home/tester/rtems-cron-next/tools/7/bin:/home/tester/rtems-cron-next/rtems-source-builder/rtems/build/tmp/sb-1002/next/rtems-microblaze/home/tester/rtems-cron-next/tools/7/bin:/home/tester/rtems-cron-next/tools/7/bin:/sbin:/bin:/usr/sbin:/usr/bin:/usr/local/sbin:/usr/local/bin:/home/tester/bin
+ test -n /home/tester/rtems-cron-next/rtems-source-builder/source-builder
+ PATH=/home/tester/rtems-cron-next/rtems-source-builder/source-builder:/home/tester/rtems-cron-next/rtems-source-builder/rtems/build/tmp/sb-1002-cxc/next/rtems-microblaze/home/tester/rtems-cron-next/tools/7/bin:/home/tester/rtems-cron-next/rtems-source-builder/rtems/build/tmp/sb-1002/next/rtems-microblaze/home/tester/rtems-cron-next/tools/7/bin:/home/tester/rtems-cron-next/tools/7/bin:/sbin:/bin:/usr/sbin:/usr/bin:/usr/local/sbin:/usr/local/bin:/home/tester/bin
+ PATH=/home/tester/rtems-cron-next/rtems-source-builder/rtems/build/tmp/sb-1002-staging/bin:/home/tester/rtems-cron-next/rtems-source-builder/rtems/build/tmp/sb-1002-internal/bin:/home/tester/rtems-cron-next/rtems-source-builder/source-builder:/home/tester/rtems-cron-next/rtems-source-builder/rtems/build/tmp/sb-1002-cxc/next/rtems-microblaze/home/tester/rtems-cron-next/tools/7/bin:/home/tester/rtems-cron-next/rtems-source-builder/rtems/build/tmp/sb-1002/next/rtems-microblaze/home/tester/rtems-cron-next/tools/7/bin:/home/tester/rtems-cron-next/tools/7/bin:/sbin:/bin:/usr/sbin:/usr/bin:/usr/local/sbin:/usr/local/bin:/home/tester/bin
+ export PATH
+ LANG=C
+ export LANG
+ unset DISPLAY
+ umask 022
+ cd /home/tester/rtems-cron-next/rtems-source-builder/rtems/build/microblaze-rtems7-gdb-16.1-x86_64-freebsd15.0-1
+ echo '=> microblaze-rtems7-gdb-16.1-x86_64-freebsd15.0-1: BUILD'
+ echo '==> %prep:'
+ pwd
+ build_top=/home/tester/rtems-cron-next/rtems-source-builder/rtems/build/microblaze-rtems7-gdb-16.1-x86_64-freebsd15.0-1
+ gdb_source=gdb-16.1
+ source_dir_gdb=gdb-16.1
+ cd /home/tester/rtems-cron-next/rtems-source-builder/rtems/build/microblaze-rtems7-gdb-16.1-x86_64-freebsd15.0-1
+ /bin/rm -rf gdb-16.1
+ /usr/bin/xz -dc /home/tester/rtems-cron-next/rtems-source-builder/rtems/sources/gdb-16.1.tar.xz
+ /usr/bin/tar -x -f -
+ tar_exit=0
+ cd gdb-16.1
+ /bin/chmod -R a+rX,g-w,o-w .
+ /bin/cat /home/tester/rtems-cron-next/rtems-source-builder/rtems/patches/gdb-14067-python-config.diff
+ /usr/bin/patch -E -p1
Hmm... Looks like a unified diff to me...
The text leading up to this was:
--------------------------
|--- gdb-13.1/gdb/python/python-config.py.orig 2023-03-26 13:51:21
|+++ gdb-13.1/gdb/python/python-config.py 2023-03-26 13:53:21
--------------------------
Patching file gdb/python/python-config.py using Plan A...
Hunk #1 succeeded at 77.
done
+ /bin/cat /home/tester/rtems-cron-next/rtems-source-builder/rtems/patches/0001-gdb-Add-support-for-TLS-under-RTEMSv16.2.patch
+ /usr/bin/patch -E -p1
Hmm... Looks like a unified diff to me...
The text leading up to this was:
--------------------------
|From a8c065f24ba53b5f37e0862526470043b3291e34 Mon Sep 17 00:00:00 2001
|From: Kinsey Moore <kinsey.moore at oarcorp.com>
|Date: Fri, 20 Jun 2025 12:07:09 -0500
|Subject: [PATCH] gdb: Add support for TLS under RTEMS
|
|This support uses the presence of the ".rtemsroset" section to detect
|whether an ELF was created using RTEMS. This works for current RTEMS
|development (7) branch, 6 branch, 5 branch, and 4.11 branch. This
|registers the TLS callback for architectures under which RTEMS is known
|to support TLS. The RTEMS GDB stub is only expected to support TLS in 6
|branch and the current development branch and will only respond without
|error to vGetTLSAddr request in those versions.
|---
| gdb/Makefile.in | 2 ++
| gdb/configure.tgt | 2 ++
| gdb/rtems-tdep.c | 74 ++++++++++++++++++++++++++++++++++++++++++++
| gdbsupport/osabi.def | 1 +
| 4 files changed, 79 insertions(+)
| create mode 100644 gdb/rtems-tdep.c
|
|diff --git a/gdb/Makefile.in b/gdb/Makefile.in
|index 6d627b61fe7..b507abc3568 100644
|--- a/gdb/Makefile.in
|+++ b/gdb/Makefile.in
--------------------------
Patching file gdb/Makefile.in using Plan A...
Hunk #1 succeeded at 874.
Hunk #2 succeeded at 1835.
Hmm... The next patch looks like a unified diff to me...
The text leading up to this was:
--------------------------
|diff --git a/gdb/configure.tgt b/gdb/configure.tgt
|index f7b9e32cba9..697e3df60f2 100644
|--- a/gdb/configure.tgt
|+++ b/gdb/configure.tgt
--------------------------
Patching file gdb/configure.tgt using Plan A...
Hunk #1 succeeded at 128.
Hmm... The next patch looks like a unified diff to me...
The text leading up to this was:
--------------------------
|diff --git a/gdb/rtems-tdep.c b/gdb/rtems-tdep.c
|new file mode 100644
|index 00000000000..9ec56fce447
|--- /dev/null
|+++ b/gdb/rtems-tdep.c
--------------------------
(Creating file gdb/rtems-tdep.c...)
Patching file gdb/rtems-tdep.c using Plan A...
Empty context always matches.
Hunk #1 succeeded at 1.
Hmm... The next patch looks like a unified diff to me...
The text leading up to this was:
--------------------------
|diff --git a/gdbsupport/osabi.def b/gdbsupport/osabi.def
|index 637da26a050..e1c69fb1c40 100644
|--- a/gdbsupport/osabi.def
|+++ b/gdbsupport/osabi.def
--------------------------
Patching file gdbsupport/osabi.def using Plan A...
Hunk #1 succeeded at 53.
Hmm... Ignoring the trailing garbage.
done
+ cd /home/tester/rtems-cron-next/rtems-source-builder/rtems/build/microblaze-rtems7-gdb-16.1-x86_64-freebsd15.0-1
+ SB_CXC=no
+ echo '==> clean %{buildroot}: /home/tester/rtems-cron-next/rtems-source-builder/rtems/build/tmp/microblaze-rtems7-gdb-16.1-x86_64-freebsd15.0-1-1002'
+ /bin/rm -rf /home/tester/rtems-cron-next/rtems-source-builder/rtems/build/tmp/microblaze-rtems7-gdb-16.1-x86_64-freebsd15.0-1-1002
==> clean %{buildroot}: /home/tester/rtems-cron-next/rtems-source-builder/rtems/build/tmp/microblaze-rtems7-gdb-16.1-x86_64-freebsd15.0-1-1002
+ /bin/mkdir -p /home/tester/rtems-cron-next/rtems-source-builder/rtems/build/tmp/microblaze-rtems7-gdb-16.1-x86_64-freebsd15.0-1-1002
+ echo '==> %build:'
+ pwd
+ build_top=/home/tester/rtems-cron-next/rtems-source-builder/rtems/build/microblaze-rtems7-gdb-16.1-x86_64-freebsd15.0-1
+ test x86_64-freebsd15.0 '!=' x86_64-freebsd15.0
+ build_dir=build
+ mkdir -p build
==> %build:
+ cd build
+ test x86_64-freebsd15.0 '!=' x86_64-freebsd15.0
+ LDFLAGS=' -L/home/tester/rtems-cron-next/rtems-source-builder/rtems/build/tmp/sb-1002-internal/lib'
+ LDLIBS=''
+ LIBS=''
+ echo '/usr/bin/cc -O2 -pipe -I/home/tester/rtems-cron-next/rtems-source-builder/rtems/build/tmp/sb-1002/next/rtems-microblaze/home/tester/rtems-cron-next/tools/7/include -I/home/tester/rtems-cron-next/rtems-source-builder/rtems/build/tmp/sb-1002-internal/include'
+ sed -e 's,-std=gnu99 ,,'
+ CC='/usr/bin/cc -O2 -pipe -I/home/tester/rtems-cron-next/rtems-source-builder/rtems/build/tmp/sb-1002/next/rtems-microblaze/home/tester/rtems-cron-next/tools/7/include -I/home/tester/rtems-cron-next/rtems-source-builder/rtems/build/tmp/sb-1002-internal/include'
+ echo '/usr/bin/c++ -O2 -pipe -I/home/tester/rtems-cron-next/rtems-source-builder/rtems/build/tmp/sb-1002/next/rtems-microblaze/home/tester/rtems-cron-next/tools/7/include -I/home/tester/rtems-cron-next/rtems-source-builder/rtems/build/tmp/sb-1002-internal/include'
+ sed -e 's,-std=gnu99 ,,'
+ CXX='/usr/bin/c++ -O2 -pipe -I/home/tester/rtems-cron-next/rtems-source-builder/rtems/build/tmp/sb-1002/next/rtems-microblaze/home/tester/rtems-cron-next/tools/7/include -I/home/tester/rtems-cron-next/rtems-source-builder/rtems/build/tmp/sb-1002-internal/include'
+ CC_FOR_BUILD='/usr/bin/cc -O2 -pipe -I/home/tester/rtems-cron-next/rtems-source-builder/rtems/build/tmp/sb-1002/next/rtems-microblaze/home/tester/rtems-cron-next/tools/7/include -I/home/tester/rtems-cron-next/rtems-source-builder/rtems/build/tmp/sb-1002-internal/include'
+ CXX_FOR_BUILD='/usr/bin/c++ -O2 -pipe -I/home/tester/rtems-cron-next/rtems-source-builder/rtems/build/tmp/sb-1002/next/rtems-microblaze/home/tester/rtems-cron-next/tools/7/include -I/home/tester/rtems-cron-next/rtems-source-builder/rtems/build/tmp/sb-1002-internal/include'
+ export CC CXX CPPFLAGS CFLAGS CXXFLAGS LDFLAGS LIBS LDLIBS
+ export CC_FOR_HOST CXX_FOR_HOST CPPFLAGS_FOR_HOST CFLAGS_FOR_HOST CXXFLAGS_FOR_HOST LDFLAGS_FOR_HOST LDLIBS_FOR_HOST LIBS_FOR_HOST
+ export CC_FOR_BUILD CXX_FOR_BUILD CFLAGS_FOR_BUILD CXXFLAGS_FOR_BUILD LDFLAGS_FOR_BUILD LDLIBS_FOR_BUILS LIBS_FOR_BUILS
+ test x86_64-freebsd15.0 '!=' x86_64-freebsd15.0
+ GDB_LIBS_STATIC=-lexpat
+ GDB_LIBS='-Xlinker -Bstatic -Xlinker -Bdynamic'
+ LIBS_STATIC=-lexpat LIBS='-Xlinker -Bstatic -Xlinker -Bdynamic' ../gdb-16.1/configure '--build=x86_64-freebsd15.0' '--host=x86_64-freebsd15.0' '--target=microblaze-rtems7' --verbose --disable-nls --disable-gas --disable-binutils --disable-ld --disable-gold --disable-gprof --without-included-gettext --disable-win32-registry --disable-werror --enable-sim --without-zlib --with-expat '--with-guile=no' '--with-libiconv-prefix=/usr/local' '--with-python=/usr/local/bin/python3' '--prefix=/home/tester/rtems-cron-next/tools/7' '--bindir=/home/tester/rtems-cron-next/tools/7/bin' '--exec-prefix=/home/tester/rtems-cron-next/tools/7' '--includedir=/home/tester/rtems-cron-next/tools/7/include' '--libdir=/home/tester/rtems-cron-next/tools/7/lib' '--mandir=/home/tester/rtems-cron-next/tools/7/share/man' '--infodir=/home/tester/rtems-cron-next/tools/7/share/info'
checking build system type... x86_64-pc-freebsd15.0
checking host system type... x86_64-pc-freebsd15.0
checking target system type... microblaze-xilinx-rtems7
checking for a BSD-compatible install... /usr/bin/install -c
checking whether ln works... yes
checking whether ln -s works... yes
checking for a sed that does not truncate output... /usr/local/bin/gsed
checking for gawk... no
checking for mawk... no
checking for nawk... nawk
configure: WARNING: neither ld nor gold are enabled
checking for gdbserver support... no
checking for x86_64-freebsd15.0-gcc... /usr/bin/cc -O2 -pipe -I/home/tester/rtems-cron-next/rtems-source-builder/rtems/build/tmp/sb-1002/next/rtems-microblaze/home/tester/rtems-cron-next/tools/7/include -I/home/tester/rtems-cron-next/rtems-source-builder/rtems/build/tmp/sb-1002-internal/include
checking whether the C compiler works... yes
checking for C compiler default output file name... a.out
checking for suffix of executables...
checking whether we are cross compiling... no
checking for suffix of object files... o
checking whether we are using the GNU C compiler... yes
checking whether /usr/bin/cc -O2 -pipe -I/home/tester/rtems-cron-next/rtems-source-builder/rtems/build/tmp/sb-1002/next/rtems-microblaze/home/tester/rtems-cron-next/tools/7/include -I/home/tester/rtems-cron-next/rtems-source-builder/rtems/build/tmp/sb-1002-internal/include accepts -g... yes
checking for /usr/bin/cc -O2 -pipe -I/home/tester/rtems-cron-next/rtems-source-builder/rtems/build/tmp/sb-1002/next/rtems-microblaze/home/tester/rtems-cron-next/tools/7/include -I/home/tester/rtems-cron-next/rtems-source-builder/rtems/build/tmp/sb-1002-internal/include option to accept ISO C89... none needed
checking for /usr/bin/cc -O2 -pipe -I/home/tester/rtems-cron-next/rtems-source-builder/rtems/build/tmp/sb-1002/next/rtems-microblaze/home/tester/rtems-cron-next/tools/7/include -I/home/tester/rtems-cron-next/rtems-source-builder/rtems/build/tmp/sb-1002-internal/include option to accept ISO C99... none needed
checking whether we are using the GNU C++ compiler... yes
checking whether /usr/bin/c++ -O2 -pipe -I/home/tester/rtems-cron-next/rtems-source-builder/rtems/build/tmp/sb-1002/next/rtems-microblaze/home/tester/rtems-cron-next/tools/7/include -I/home/tester/rtems-cron-next/rtems-source-builder/rtems/build/tmp/sb-1002-internal/include accepts -g... yes
checking whether g++ accepts -static-libstdc++ -static-libgcc... no
checking for x86_64-freebsd15.0-gnatbind... no
checking for gnatbind... no
checking for x86_64-freebsd15.0-gnatmake... no
checking for gnatmake... no
checking whether compiler driver understands Ada and is recent enough... no
checking for x86_64-freebsd15.0-gdc... no
checking for gdc... no
checking whether the D compiler works... no
checking for cargo... no
checking how to compare bootstrapped objects... cmp --ignore-initial=16 $$f1 $$f2
checking for objdir... .libs
checking for the correct version of gmp.h... yes
checking for the correct version of mpfr.h... no
configure: error: Building GDB requires GMP 4.2+, and MPFR 3.1.0+.
Try the --with-gmp and/or --with-mpfr options to specify
their locations. If you obtained GMP and/or MPFR from a vendor
distribution package, make sure that you have installed both the libraries
and the header files. They may be located in separate packages.
shell cmd failed: /bin/sh -ex /home/tester/rtems-cron-next/rtems-source-builder/rtems/build/microblaze-rtems7-gdb-16.1-x86_64-freebsd15.0-1/do-build
error: building microblaze-rtems7-gdb-16.1-x86_64-freebsd15.0-1
See error report: rsb-report-microblaze-rtems7-gdb-16.1-x86_64-freebsd15.0-1.txt
Note: In some cases the error appears only in
the complete build log (see --log option)
- - - - - - - - - - - - - - - - - - - - - - - - - - - - - - - - - - - - - - - -
= = = = = = = = = = = = = = = = = = = = = = = = = = = = = = = = = = = = = = = =
Build FAILED: microblaze-rtems7-gcc-87a5641-newlib-038afec1-x86_64-freebsd15.0-1
- - - - - - - - - - - - - - - - - - - - - - - - - - - - - - - - - - - - - - - -
yes
yes
checking if /usr/bin/c++ -O2 -pipe -I/home/tester/rtems-cron-next/rtems-source-builder/rtems/build/tmp/sb-1002/next/rtems-microblaze/home/tester/rtems-cron-next/tools/7/include -I/home/tester/rtems-cron-next/rtems-source-builder/rtems/build/tmp/sb-1002-internal/include supports -c -o file.o... (cached) yes
checking whether the /usr/bin/c++ -O2 -pipe -I/home/tester/rtems-cron-next/rtems-source-builder/rtems/build/tmp/sb-1002/next/rtems-microblaze/home/tester/rtems-cron-next/tools/7/include -I/home/tester/rtems-cron-next/rtems-source-builder/rtems/build/tmp/sb-1002-internal/include linker (/usr/bin/ld) supports shared libraries... yes
checking dynamic linker characteristics... freebsd15.0 ld.so
checking how to hardcode library paths into programs... yes
immediate
checking for a sed that does not truncate output... (cached) /usr/local/bin/gsed
checking for a Python interpreter with version >= 2.5... checking for setlocale... checking for basename... checking whether fread_unlocked is declared... python
checking for python... /usr/local/bin/python
checking for python version... 3.1
checking for python platform... freebsd15
checking for python script directory... checking for grep that handles long lines and -e... /usr/bin/grep
checking for egrep... /usr/bin/grep -E
checking for ANSI C header files... yes
checking whether fwrite_unlocked is declared... ${prefix}/lib/python3.12/site-packages
checking for python extension module directory... ${exec_prefix}/lib/python3.12/site-packages
checking for cygpath... no
checking for perl... perl
checking for pdflatex... no
checking for pod2html... pod2html
checking for stdint types... yes
yes
checking for bcmp... checking for stpcpy... yes
checking whether getchar_unlocked is declared... stdint.h (shortcircuit)
make use of stdint.h in include/isl/stdint.h (assuming C99 compatible system)
checking which gmp to use... system
checking gmp.h usability... yes
checking whether getc_unlocked is declared... yes
yes
checking for strcasecmp... checking for bcopy... yes
checking gmp.h presence... yes
checking whether putchar_unlocked is declared... yes
checking for gmp.h... yes
checking for main in -lgmp... yes
checking for sys/types.h... yes
checking whether putc_unlocked is declared... yes
yes
checking for bsearch... checking for strdup... yes
checking for sys/stat.h... yes
checking for an ANSI C-conforming const... no
configure: error: gmp library not found
yes
gmake[1]: *** [Makefile:5839: configure-isl] Error 1
checking for stdlib.h... yes
checking sys/mman.h usability... yes
yes
checking for bzero... checking for strtoul... yes
checking for string.h... yes
checking sys/mman.h presence... yes
checking for sys/mman.h... yes
checking for mmap... yes
checking for memory.h... yes
yes
checking for tsearch... checking for calloc... yes
checking for strings.h... yes
checking whether read-only mmap of a plain file works... yes
checking whether mmap from /dev/zero works... yes
checking for MAP_ANON(YMOUS)... yes
checking for inttypes.h... yes
yes
checking for __argz_count... checking for clock... yes
checking whether mmap with MAP_ANON(YMOUS) works... yes
checking whether to enable maintainer-specific portions of Makefiles... no
yes
checking for stdint.h... configure: updating cache ./config.cache
configure: creating ./config.status
yes
checking for unistd.h... yes
no
checking for __argz_stringify... checking for ffs... config.status: creating Makefile
config.status: creating mkheaders.almost
yes
config.status: creating config.h
checking minix/config.h usability... no
checking minix/config.h presence... yes
no
checking for getcwd... checking for __argz_next... no
checking for minix/config.h... no
checking whether it is safe to define __EXTENSIONS__... yes
checking for special C compiler options needed for large files... no
checking for _FILE_OFFSET_BITS value needed for large files... no
yes
checking whether /usr/bin/cc -O2 -pipe -I/home/tester/rtems-cron-next/rtems-source-builder/rtems/build/tmp/sb-1002/next/rtems-microblaze/home/tester/rtems-cron-next/tools/7/include -I/home/tester/rtems-cron-next/rtems-source-builder/rtems/build/tmp/sb-1002-internal/include supports -W... no
checking for getpagesize... checking for __fsetlocking... yes
checking whether /usr/bin/cc -O2 -pipe -I/home/tester/rtems-cron-next/rtems-source-builder/rtems/build/tmp/sb-1002/next/rtems-microblaze/home/tester/rtems-cron-next/tools/7/include -I/home/tester/rtems-cron-next/rtems-source-builder/rtems/build/tmp/sb-1002-internal/include supports -Wall... yes
checking whether /usr/bin/cc -O2 -pipe -I/home/tester/rtems-cron-next/rtems-source-builder/rtems/build/tmp/sb-1002/next/rtems-microblaze/home/tester/rtems-cron-next/tools/7/include -I/home/tester/rtems-cron-next/rtems-source-builder/rtems/build/tmp/sb-1002-internal/include supports -Wwrite-strings... yes
no
checking for iconv... checking for gettimeofday... yes
checking whether /usr/bin/cc -O2 -pipe -I/home/tester/rtems-cron-next/rtems-source-builder/rtems/build/tmp/sb-1002/next/rtems-microblaze/home/tester/rtems-cron-next/tools/7/include -I/home/tester/rtems-cron-next/rtems-source-builder/rtems/build/tmp/sb-1002-internal/include supports -Wc++-compat... yes
checking whether /usr/bin/cc -O2 -pipe -I/home/tester/rtems-cron-next/rtems-source-builder/rtems/build/tmp/sb-1002/next/rtems-microblaze/home/tester/rtems-cron-next/tools/7/include -I/home/tester/rtems-cron-next/rtems-source-builder/rtems/build/tmp/sb-1002-internal/include supports -Wstrict-prototypes... yes
checking for index... yes
checking for iconv declaration... yes
checking whether /usr/bin/cc -O2 -pipe -I/home/tester/rtems-cron-next/rtems-source-builder/rtems/build/tmp/sb-1002/next/rtems-microblaze/home/tester/rtems-cron-next/tools/7/include -I/home/tester/rtems-cron-next/rtems-source-builder/rtems/build/tmp/sb-1002-internal/include supports -Wshadow=local...
extern size_t iconv (iconv_t cd, char * *inbuf, size_t *inbytesleft, char * *outbuf, size_t *outbytesleft);
checking for nl_langinfo and CODESET... yes
checking whether /usr/bin/cc -O2 -pipe -I/home/tester/rtems-cron-next/rtems-source-builder/rtems/build/tmp/sb-1002/next/rtems-microblaze/home/tester/rtems-cron-next/tools/7/include -I/home/tester/rtems-cron-next/rtems-source-builder/rtems/build/tmp/sb-1002-internal/include supports -pedantic ... yes
checking whether /usr/bin/cc -O2 -pipe -I/home/tester/rtems-cron-next/rtems-source-builder/rtems/build/tmp/sb-1002/next/rtems-microblaze/home/tester/rtems-cron-next/tools/7/include -I/home/tester/rtems-cron-next/rtems-source-builder/rtems/build/tmp/sb-1002-internal/include and cc understand -c and -o together... yes
checking for insque... yes
checking for LC_MESSAGES... yes
checking for memchr... yes
checking for bison... bison
checking version of bison... 3.8.2, ok
checking whether NLS is requested... no
checking whether to use NLS... no
checking for aclocal... no
checking for autoconf... no
checking for autoheader... no
checking bison 3 or later... 3.8.2, bison3
configure: updating cache ./config.cache
yes
checking for an ANSI C-conforming const... configure: creating ./config.status
yes
checking for memcmp... yes
checking for inline... config.status: creating Makefile
config.status: creating config.intl
inline
checking whether byte ordering is bigendian... config.status: creating config.h
config.status: executing default-1 commands
yes
checking for memcpy... no
checking for a BSD-compatible install... /usr/bin/install -c
checking for CET support... no
checking for sys/file.h... yes
checking for memmem... yes
checking for sys/param.h... yes
checking for limits.h... yes
checking for stdlib.h... (cached) yes
checking for malloc.h... yes
checking for memmove... yes
checking for string.h... (cached) yes
checking for unistd.h... (cached) yes
checking for strings.h... (cached) yes
checking for sys/time.h... yes
checking for time.h... yes
yes
checking for mempcpy... checking for sys/resource.h... yes
checking for sys/stat.h... (cached) yes
checking for sys/mman.h... yes
checking for fcntl.h... yes
checking for memset... yes
checking for alloca.h... no
checking for sys/pstat.h... no
checking for sys/sysmp.h... yes
checking for mkstemps... no
checking for sys/sysinfo.h... no
checking for machine/hal_sysinfo.h... no
checking for sys/table.h... yes
checking for putenv... no
checking for sys/sysctl.h... yes
checking for sys/systemcfg.h... yes
checking for random... no
checking for stdint.h... (cached) yes
checking for stdio_ext.h... no
checking for process.h... no
checking for sys/prctl.h... yes
checking for rename... no
checking for sys/wait.h that is POSIX.1 compatible... yes
checking whether time.h and sys/time.h may both be included... yes
checking for rindex... yes
checking whether errno must be declared... no
checking size of int... yes
checking for setenv... 4
checking size of long... yes
checking for snprintf... 8
checking size of size_t... yes
checking for sigsetmask... yes
checking for stpcpy... 8
checking for long long... yes
checking for stpncpy... yes
checking size of long long... yes
checking for strcasecmp... 8
checking for a 64-bit type... uint64_t
checking for intptr_t... yes
checking for strchr... yes
checking for uintptr_t... yes
checking for strdup... yes
checking for ssize_t... yes
checking for strncasecmp... yes
checking for pid_t... yes
checking for strndup... yes
checking for library containing strerror... yes
checking for strnlen... none required
checking for asprintf... yes
checking for strrchr... yes
checking for atexit... yes
checking for strstr... yes
checking for basename... yes
checking for strtod... yes
checking for bcmp... yes
checking for strtol... yes
checking for bcopy... yes
checking for strtoul... yes
checking for bsearch... yes
checking for strtoll... yes
checking for bzero... yes
checking for strtoull... yes
checking for calloc... yes
checking for strverscmp... yes
checking for clock... yes
checking for tmpnam... yes
checking for ffs... yes
checking for vasprintf... yes
checking for getcwd... yes
checking for vfprintf... yes
checking for getpagesize... yes
checking for vprintf... yes
checking for gettimeofday... yes
checking for vsnprintf... yes
checking for index... yes
checking for vsprintf... yes
checking for insque... yes
checking for waitpid... yes
checking for memchr... yes
checking for setproctitle... yes
checking for memcmp... yes
checking whether alloca needs Cray hooks... no
checking stack direction for C alloca... yes
checking for memcpy... -1
checking for vfork.h... no
yes
checking for fork... checking for memmem... yes
yes
checking for vfork... checking for memmove... yes
yes
checking for working fork... checking for mempcpy... yes
checking for memset... yes
checking for working vfork... (cached) yes
checking for _doprnt... yes
no
checking for sys_errlist... checking for mkstemps... yes
yes
checking for sys_nerr... checking for putenv... yes
yes
checking for sys_siglist... checking for random... yes
yes
checking for external symbol _system_configuration... checking for rename... no
checking for __fsetlocking... yes
checking for rindex... no
checking for canonicalize_file_name... yes
checking for setenv... no
checking for dup3... yes
checking for snprintf... yes
checking for getrlimit... yes
checking for sigsetmask... yes
checking for getrusage... yes
checking for stpcpy... yes
checking for getsysinfo... yes
checking for stpncpy... no
checking for gettimeofday... (cached) yes
checking for on_exit... yes
checking for strcasecmp... no
checking for pipe2... yes
checking for strchr... yes
checking for psignal... yes
checking for strdup... yes
checking for pstat_getdynamic... yes
checking for strncasecmp... no
checking for pstat_getstatic... yes
checking for strndup... no
checking for realpath... yes
checking for strnlen... yes
checking for setrlimit... yes
checking for strrchr... yes
checking for spawnve... yes
checking for strstr... no
checking for spawnvpe... yes
checking for strtod... no
checking for strerror... yes
checking for strtol... yes
checking for strsignal... yes
checking for strtoul... yes
checking for sysconf... yes
checking for strtoll... yes
checking for sysctl... yes
checking for strtoull... yes
checking for sysmp... yes
checking for strverscmp... no
checking for table... yes
checking for tmpnam... no
checking for times... yes
checking for vasprintf... yes
checking for wait3... yes
checking for vfprintf... yes
checking for wait4... yes
checking for vprintf... yes
checking for sbrk... yes
checking for vsnprintf... yes
checking whether basename is declared... no
checking whether ffs is declared... yes
checking for vsprintf... yes
checking whether asprintf is declared... yes
checking whether vasprintf is declared... yes
checking for waitpid... yes
checking whether snprintf is declared... yes
checking for setproctitle... yes
checking whether vsnprintf is declared... yes
checking whether calloc is declared... yes
checking whether alloca needs Cray hooks... yes
checking whether getenv is declared... no
checking stack direction for C alloca... yes
checking whether getopt is declared... yes
checking whether malloc is declared... -1
checking for vfork.h... no
checking for fork... yes
checking whether realloc is declared... yes
checking whether sbrk is declared... yes
checking for vfork... yes
checking whether strtol is declared... yes
checking whether strtoul is declared... yes
checking for working fork... yes
checking whether strtoll is declared... yes
checking whether strtoull is declared... yes
checking for working vfork... (cached) yes
checking for _doprnt... yes
checking whether strverscmp is declared... no
checking for sys_errlist... yes
checking whether strnlen is declared... yes
checking whether canonicalize_file_name must be declared... yes
checking for sys_nerr... yes
checking for stdlib.h... (cached) yes
checking for unistd.h... (cached) yes
checking for sys/param.h... (cached) yes
checking for getpagesize... (cached) yes
checking for working mmap... yes
checking for sys_siglist... yes
checking for working strncmp... yes
checking for external symbol _system_configuration... no
checking for __fsetlocking... yes
configure: updating cache ./config.cache
configure: creating ./config.status
no
checking for canonicalize_file_name... config.status: creating Makefile
config.status: creating testsuite/Makefile
config.status: creating config.h
config.status: executing default commands
no
checking for dup3... yes
checking for getrlimit... yes
checking for getrusage... yes
checking for getsysinfo... no
checking for gettimeofday... (cached) yes
checking for on_exit... no
checking for pipe2... yes
checking for psignal... yes
checking for pstat_getdynamic... no
checking for pstat_getstatic... no
checking for realpath... yes
checking for setrlimit... yes
checking for spawnve... no
checking for spawnvpe... no
checking for strerror... yes
checking for strsignal... yes
checking for sysconf... yes
checking for sysctl... yes
checking for sysmp... no
checking for table... no
checking for times... yes
checking for wait3... yes
checking for wait4... yes
checking for sbrk... yes
checking whether basename is declared... no
checking whether ffs is declared... yes
checking whether asprintf is declared... yes
checking whether vasprintf is declared... yes
checking whether snprintf is declared... yes
checking whether vsnprintf is declared... yes
checking whether calloc is declared... yes
checking whether getenv is declared... yes
checking whether getopt is declared... yes
checking whether malloc is declared... yes
checking whether realloc is declared... yes
checking whether sbrk is declared... yes
checking whether strtol is declared... yes
checking whether strtoul is declared... yes
checking whether strtoll is declared... yes
checking whether strtoull is declared... yes
checking whether strverscmp is declared... yes
checking whether strnlen is declared... yes
checking whether canonicalize_file_name must be declared... yes
checking for stdlib.h... (cached) yes
checking for unistd.h... (cached) yes
checking for sys/param.h... (cached) yes
checking for getpagesize... (cached) yes
checking for working mmap... yes
checking for working strncmp... yes
configure: updating cache ./config.cache
configure: creating ./config.status
config.status: creating Makefile
config.status: creating testsuite/Makefile
config.status: creating config.h
config.status: executing default commands
gmake[1]: Leaving directory '/home/tester/rtems-cron-next/rtems-source-builder/rtems/build/microblaze-rtems7-gcc-87a5641-newlib-038afec1-x86_64-freebsd15.0-1/build'
gmake: *** [Makefile:1033: all] Error 2
gmake: Leaving directory '/home/tester/rtems-cron-next/rtems-source-builder/rtems/build/microblaze-rtems7-gcc-87a5641-newlib-038afec1-x86_64-freebsd15.0-1/build'
shell cmd failed: /bin/sh -ex /home/tester/rtems-cron-next/rtems-source-builder/rtems/build/microblaze-rtems7-gcc-87a5641-newlib-038afec1-x86_64-freebsd15.0-1/do-build
error: building microblaze-rtems7-gcc-87a5641-newlib-038afec1-x86_64-freebsd15.0-1
See error report: rsb-report-microblaze-rtems7-gcc-87a5641-newlib-038afec1-x86_64-freebsd15.0-1.txt
Note: In some cases the error appears only in
the complete build log (see --log option)
- - - - - - - - - - - - - - - - - - - - - - - - - - - - - - - - - - - - - - - -
Sizes
=====
Maximum build usage: 819.156MB
Total size: 582.806MB
Installed : 191.242MB
Sources: 391.244MB
Patches: 326.623KB
Output
======
Build Set: next/rtems-microblaze
config: devel/expat-2.7.3-1.cfg
package: expat-2.7.3-x86_64-freebsd15.0-1
building: expat-2.7.3-x86_64-freebsd15.0-1
sizes: expat-2.7.3-x86_64-freebsd15.0-1: 12.392MB (installed: 1.637MB)
cleaning: expat-2.7.3-x86_64-freebsd15.0-1
reporting: devel/expat-2.7.3-1.cfg -> expat-2.7.3-x86_64-freebsd15.0-1.txt
reporting: devel/expat-2.7.3-1.cfg -> expat-2.7.3-x86_64-freebsd15.0-1.xml
config: devel/gmp-6.2.1.cfg
package: gmp-6.2.1-x86_64-freebsd15.0-1
download: https://dl.rtems.org/8904334a3bcc5c896ececabc75cda9dec642e401fb5397c4992c4fabea5e962c9ce8bd44e8e4233c34e55c8010cc28db0545f5f750cbdbb5f00af538dc763be9/gmp-6.2.1.tar.bz2 -> sources/gmp-6.2.1.tar.bz2
building: gmp-6.2.1-x86_64-freebsd15.0-1
sizes: gmp-6.2.1-x86_64-freebsd15.0-1: 22.697MB (installed: 1.725MB)
cleaning: gmp-6.2.1-x86_64-freebsd15.0-1
reporting: devel/gmp-6.2.1.cfg -> gmp-6.2.1-x86_64-freebsd15.0-1.txt
reporting: devel/gmp-6.2.1.cfg -> gmp-6.2.1-x86_64-freebsd15.0-1.xml
config: tools/rtems-gdb-16.1.cfg
package: microblaze-rtems7-gdb-16.1-x86_64-freebsd15.0-1
download: https://dl.rtems.org/17b322fde0655a849506851c879aba9ad1f8bfee804b900efc718806091bec75511383bd4d632b8b32a32ef207233331581501157df18a8df528abe6ff667577/gdb-16.1.tar.xz -> sources/gdb-16.1.tar.xz
building: microblaze-rtems7-gdb-16.1-x86_64-freebsd15.0-1
error: building microblaze-rtems7-gdb-16.1-x86_64-freebsd15.0-1
Build FAILED
See error report: rsb-report-microblaze-rtems7-gdb-16.1-x86_64-freebsd15.0-1.txt
Note: In some cases the error appears only in
the complete build log (see --log option)
error: building microblaze-rtems7-gdb-16.1-x86_64-freebsd15.0-1
config: tools/rtems-xilinx-binutils-2.36.cfg
package: microblaze-rtems7-binutils-7af075d-x86_64-freebsd15.0-1
download: https://dl.rtems.org/fe4ef5c6ee694f9aaf914a677240d5c8132d2d881676d407485e0c601a5fc9e9e5ac7c3850df1107993b38f304baf9a12ad8b31b3cd1bcf46b707078455b8930/binutils-gdb-7af075d.tar.gz -> sources/binutils-gdb-7af075d.tar.gz
download: https://dl.rtems.org/56971b06821d7ab36b068016dde6086941121fca40d661056fe03f17507dafab075b306fe91d191c3fa0ec3617cd8649fe3023e0e5230e3fd5b4c2a648c23a94/0001-Add-wdc.ext.clear-and-wdc.ext.flush-insns.patch -> patches/0001-Add-wdc.ext.clear-and-wdc.ext.flush-insns.patch
download: https://dl.rtems.org/e6240d8d5eebb36b161b77348522cd59dad008017ce7579b66310719faa8bdba9d0f0466f4d81bf8c1d79ed2a3a2d777924a404da1010fc4dd866fcae2bde322/0002-Add-mlittle-endian-and-mbig-endian-flags.patch -> patches/0002-Add-mlittle-endian-and-mbig-endian-flags.patch
download: https://dl.rtems.org/2d90ef568bb649bc79b09ec3e745a25b5f177dc49f6b6bf7e9143685e5206bb7aee7a3fd3d013d64d82e2865e90a9cfeb7103aeb29189b1330613c562597a2fc/0003-Disable-the-warning-message-for-eh_frame_hdr.patch -> patches/0003-Disable-the-warning-message-for-eh_frame_hdr.patch
download: https://dl.rtems.org/76780fc9e410739320f07dd2fc517631f0bb4a8484d56ed96f0f8089acf1f8958dbc4045bfe67289086a63b3374a63e8fb2e09f7e7d52579b04d1114022d7214/0004-LOCAL-Fix-relaxation-of-assembler-resolved-reference.patch -> patches/0004-LOCAL-Fix-relaxation-of-assembler-resolved-reference.patch
download: https://dl.rtems.org/76a76edd26dc9bd72b0330791d14362933f5bbbc5bef0f9a9e6ee307958a4f6791ceabdaadae3c969ac3f4c786b13784f473fde6fe8ddcbf3370ccfc8761d7ab/0005-upstream-change-to-garbage-collection-sweep-causes-m.patch -> patches/0005-upstream-change-to-garbage-collection-sweep-causes-m.patch
download: https://dl.rtems.org/deed94f04fa91e993043f3e2f5e7c865555a7ffce83e959980daebc255247ba51d991d6289e682fa4dff1758f085e661f5c2888b078dcaf2e790873c96520928/0006-Fix-bug-in-TLSTPREL-Relocation.patch -> patches/0006-Fix-bug-in-TLSTPREL-Relocation.patch
download: https://dl.rtems.org/8fb1c588eeae2356001d2d79e06c0a6dcd37be6411c11856b064973860139d1b87d490133fd98b5d70bea24f275bdbd5114e11a41141c0be05f23317b187e705/0007-Added-Address-extension-instructions.patch -> patches/0007-Added-Address-extension-instructions.patch
download: https://dl.rtems.org/e8227eb42b87de038430ddf79bf9f7e58deee0ed263ce521512b0568456f36aab16f9cdcdb2af2b7d0e5330aab0d73479a91480731e86370d63af708d641f903/0008-fixing-the-MAX_OPCODES-to-correct-value.patch -> patches/0008-fixing-the-MAX_OPCODES-to-correct-value.patch
download: https://dl.rtems.org/c1bcc51762b66706b286ffd50f3d55dcb99cdc43d2312e0af16b1c1444fe57cf1351d55267438cdd8c755d197646d9726873338b9f892ceb27810f324533e01c/0009-Add-new-bit-field-instructions.patch -> patches/0009-Add-new-bit-field-instructions.patch
download: https://dl.rtems.org/15ae27cae58d375e74468bede264450b944c698e9e67fda41ba8044826695b7790f1b5b28d9484e016b49accaebfc9002e7a724854147ab2986deafb9557694c/0010-fixing-the-imm-bug.patch -> patches/0010-fixing-the-imm-bug.patch
download: https://dl.rtems.org/3d4c21f650c18771f202d9e9b858a4f93ee1848328eaa4b55c62f4cff86e45aa62d94b323c60ba759160d086800ae039f62236c041fede5347a91ef3467a03cc/0011-Patch-Microblaze-fixed-bug-in-GCC-so-that-It-will-su.patch -> patches/0011-Patch-Microblaze-fixed-bug-in-GCC-so-that-It-will-su.patch
download: https://dl.rtems.org/e3100a06f4a5a816dbde2af496ed0a8fbb37e94a7188fef58c9fe78212de75ddf28d45b38bd605f58157925b1f56ef137ab5f89accb6bb478b4144647416c20a/0012-fixing-the-constant-range-check-issue.patch -> patches/0012-fixing-the-constant-range-check-issue.patch
download: https://dl.rtems.org/7d52717cdd4680434935018edbf5b20b0a545494d33b54735238aefeb340476b7b04d40372f4c664f7cfdf346217bcbf70d1484cdcc7ffaabe74961d4be784a6/0013-Patch-Microblaze-Compiler-will-give-error-messages-i.patch -> patches/0013-Patch-Microblaze-Compiler-will-give-error-messages-i.patch
building: microblaze-rtems7-binutils-7af075d-x86_64-freebsd15.0-1
sizes: microblaze-rtems7-binutils-7af075d-x86_64-freebsd15.0-1: 627.914MB (installed: 126.470MB)
cleaning: microblaze-rtems7-binutils-7af075d-x86_64-freebsd15.0-1
reporting: tools/rtems-xilinx-binutils-2.36.cfg -> microblaze-rtems7-binutils-7af075d-x86_64-freebsd15.0-1.txt
reporting: tools/rtems-xilinx-binutils-2.36.cfg -> microblaze-rtems7-binutils-7af075d-x86_64-freebsd15.0-1.xml
config: tools/rtems-xilinx-gcc-12-newlib-head.cfg
package: microblaze-rtems7-gcc-87a5641-newlib-038afec1-x86_64-freebsd15.0-1
download: https://dl.rtems.org/4ded33f77b74eb7bfa2d32f68fc909454ddb5400ba795125f7003c777513dac17b1cae793442400647ec9d85a0c2a74666340ef6228db595412fbca62e735c8d/gcc-87a5641.tar.gz -> sources/gcc-87a5641.tar.gz
download: https://dl.rtems.org/413f14374856f8bfd2bb94a56f1860fff8fe9a936f33c96fdf6a5a0c5a30e2cf7d05026d0338e8b30015a93d80169a602397076b947c8292ac5b5cdc2237ec4e/0001-Back-port-v1-of-gcov-tool-merge-stream-to-GCC-12.patch -> patches/0001-Back-port-v1-of-gcov-tool-merge-stream-to-GCC-12.patch
download: https://dl.rtems.org/bbaae12a16c25f0a57d8389bfd860c451c18a9173ef4c7f7305501020c1843a005cbfe156d51694cbcb345e3089040b50ee9aaebaa800503da961f581d30f0c4/gcc-12-RTEMS-Use-local-exec-TLS-model-by-default.patch -> patches/gcc-12-RTEMS-Use-local-exec-TLS-model-by-default.patch
download: https://dl.rtems.org/7597a1315e10b664a55e8a5ee1ae30eb08af2f7f58d8d605673f2a749c071d9164a7973bc94731cd0f812c829199a7b47d18cc401fdb8fba153d5bd9536a9880/gcc-12-RTEMS-Enable-some-features-in-libstdc.patch -> patches/gcc-12-RTEMS-Enable-some-features-in-libstdc.patch
download: https://dl.rtems.org/f4c711a488abe1ca6330a0a60213b3fc1743e3d306c265315239d86402ac8f4fde069b050452cc618e7e5548c4528c7819f38641881d81faa0af7de3192bc24b/0001-LOCAL-Testsuite-builtins-tests-require-fpic.patch -> patches/0001-LOCAL-Testsuite-builtins-tests-require-fpic.patch
download: https://dl.rtems.org/f18caa3d3bbc1d44eaba33ee95d1d742249745d1c3b9f46e5a2492e2d3dbbd7434f0150a7067cc6dfd0e2165f0d1995e866dea4329448ca7f12e1030a470580a/0002-LOCAL-Quick-fail-g-.dg-opt-memcpy1.C.patch -> patches/0002-LOCAL-Quick-fail-g-.dg-opt-memcpy1.C.patch
download: https://dl.rtems.org/b424724f69abcf7c3bcd685edc82866df4d5d7667e068311ee1dd3bfe3400e540cbd8a67b9aa8c69abb4ef9297fbe3bdd9526de47dd265b06b3ae5a7005a811d/0003-LOCAL-For-dejagnu-static-testing-on-qemu-suppress-wa.patch -> patches/0003-LOCAL-For-dejagnu-static-testing-on-qemu-suppress-wa.patch
download: https://dl.rtems.org/b7e5ff18b84a320e7a4b4504e8209231354276d1246e74c5f1468cb20b0d4b59af25573652063ce96f5955b626e9c28dcaaa52b411c25eab9c03c45287d146c6/0004-Patch-testsuite-Add-MicroBlaze-to-target-supports-fo.patch -> patches/0004-Patch-testsuite-Add-MicroBlaze-to-target-supports-fo.patch
download: https://dl.rtems.org/23ca04a2e16c2b32c9baab14d388e6e74c057313fa0064f2d44eb8df5a0f74c8a0529ec159de3962924dd1a227885e6f413b005b72c766b945be1f8e6708fb10/0005-Patch-testsuite-Update-MicroBlaze-strings-test.patch -> patches/0005-Patch-testsuite-Update-MicroBlaze-strings-test.patch
download: https://dl.rtems.org/9ef4108d8ab54377b5579dd835cb5d248e6fe3778335a795865e7ec83428cda31286a81f0a9669460f13cf759c6f66615493fef00b44802480c70abe4646a5bf/0006-Patch-testsuite-Allow-MicroBlaze-.weakext-pattern-in.patch -> patches/0006-Patch-testsuite-Allow-MicroBlaze-.weakext-pattern-in.patch
download: https://dl.rtems.org/dfb1101f59ef20757f9a16c4235ecb3af3a7f1929f8d714e9835057d2fae88b88c5ad873c3eb2bc6ff67c94e6fb01e0ac0c4be1eea2493ed70962fe712717d75/0007-Patch-testsuite-Add-MicroBlaze-to-check_profiling_av.patch -> patches/0007-Patch-testsuite-Add-MicroBlaze-to-check_profiling_av.patch
download: https://dl.rtems.org/676edf672931df8cfe954750221de9ec272fffd8b1f17e0a2e3316b6f3cc6d4503aad9db10781a4555296ba94a44447ea251ef23e389e325607a29ac5d3d38e3/0008-Patch-microblaze-Fix-atomic-side-effects.patch -> patches/0008-Patch-microblaze-Fix-atomic-side-effects.patch
download: https://dl.rtems.org/acbe070096c44976c0c8add4b5a3577494f475e6d65eecfc92e9fe300bc233f44319acd837b6f4f50cd760898a5e533ddca19fd8deaf147881ae6626bdf9bea2/0009-Patch-microblaze-Fix-atomic-boolean-return-value.patch -> patches/0009-Patch-microblaze-Fix-atomic-boolean-return-value.patch
download: https://dl.rtems.org/7ab88f74bc86935d99a3bb05f256db1ddfff2a1693da6b890bc9e521421011cde70c5ed057e51e39447c260f0bf4b95da6ebfdefc248270710a73000307071fc/0010-Patch-microblaze-Fix-the-Microblaze-crash-with-msmal.patch -> patches/0010-Patch-microblaze-Fix-the-Microblaze-crash-with-msmal.patch
download: https://dl.rtems.org/0f0f37464f956e991247af32eee6384e9c7e7e72d97646e48af0e3289c5ff5d9b08b1ab588dae5f71860ad439cd6b35e5064b28774986d3284a2dc2ba90a21c0/0011-Patch-microblaze-Added-ashrsi3_with_size_opt.patch -> patches/0011-Patch-microblaze-Added-ashrsi3_with_size_opt.patch
download: https://dl.rtems.org/d7c61baaa77416c306215716344e703bd8687251bc921e071e4ae7ba06a6275a25201723070f4352bbfb1522aa430482781e0bde7edd728b460e590577bcabf4/0012-Patch-microblaze-Use-bralid-for-profiler-calls.patch -> patches/0012-Patch-microblaze-Use-bralid-for-profiler-calls.patch
download: https://dl.rtems.org/87dec1566f3e2e539d3a97fea4306f50e95e318da0d2c3f28d8db106efd71cb46ca825c79c86fd3a9d6ff08380a6414a2a65c05e09395da1f44f4aecee37f27b/0013-Patch-microblaze-Removed-moddi3-routinue.patch -> patches/0013-Patch-microblaze-Removed-moddi3-routinue.patch
download: https://dl.rtems.org/84253c3c180fbfc6b640ffda72e8574f95661bdf3132503acc3f1b73a8f78aeb0508c06dbb32d1c8363ff083765194eeff14e46445946969c51a4498d2b3a0e7/0001-gcc-config-aarch64-rtems.h-Define-__USE_INIT_FINI__.patch -> patches/0001-gcc-config-aarch64-rtems.h-Define-__USE_INIT_FINI__.patch
download: https://dl.rtems.org/bf1ec7eff0dd51d154dd0507edb085458c90a000f5a3ccefb1064147cf8fdafe0111d2094372e164976f2193c289bff9ea63dcad43555c90893272a494b7e779/0002-config-microblaze-crti.S-Add-single-underscore-init-.patch -> patches/0002-config-microblaze-crti.S-Add-single-underscore-init-.patch
download: https://dl.rtems.org/39c0666c2e5c560447f00ed913cd07261e9c0db05b0cc549400667013ccf1d4140c0bd7b012d60dd628235bf7ae27564460a45e969e9cff75d14ed94bfd82632/0001-microblaze-Define-__ELF__-for-RTEMS-target.patch -> patches/0001-microblaze-Define-__ELF__-for-RTEMS-target.patch
download: https://dl.rtems.org/c07fdb605a6520d194358504731e63b540211ef680383f1ca4ec65b4ac43ae27687534fd7d8196a4dbe83a0ecf2c42a4254c71e609ee484a7614573bc499a2e8/fix-mac-arm64-isl-config.patch -> patches/fix-mac-arm64-isl-config.patch
download: https://dl.rtems.org/3279f813ab37f47fdcc800e4ac5f306417d07f539593ca715876e43e04896e1d5bceccfb288ef2908a3f24b760747d0dbd0392a24b9b341bc3e12082e5c836ee/mpc-1.2.1.tar.gz -> sources/mpc-1.2.1.tar.gz
download: https://dl.rtems.org/2849b11e360ea98e0b4d708c67723ad2d6c7bac6d1e469673f408b0111cf0278429e8bc38fd2b7538dc2d5bb0cc430c646a0fa7f0b6b105a0482a5455fadc8b9/fix-mac-arm64-mpc-config.patch -> patches/fix-mac-arm64-mpc-config.patch
building: microblaze-rtems7-gcc-87a5641-newlib-038afec1-x86_64-freebsd15.0-1
error: building microblaze-rtems7-gcc-87a5641-newlib-038afec1-x86_64-freebsd15.0-1
Build FAILED
See error report: rsb-report-microblaze-rtems7-gcc-87a5641-newlib-038afec1-x86_64-freebsd15.0-1.txt
Note: In some cases the error appears only in
the complete build log (see --log option)
error: building microblaze-rtems7-gcc-87a5641-newlib-038afec1-x86_64-freebsd15.0-1
config: tools/rtems-tools-7.cfg
package: rtems-tools-da2a7f68ed666cc4b3872448adf060129f0ebb5c-1
building: rtems-tools-da2a7f68ed666cc4b3872448adf060129f0ebb5c-1
sizes: rtems-tools-da2a7f68ed666cc4b3872448adf060129f0ebb5c-1: 251.118MB (installed: 61.410MB)
cleaning: rtems-tools-da2a7f68ed666cc4b3872448adf060129f0ebb5c-1
reporting: tools/rtems-tools-7.cfg -> rtems-tools-da2a7f68ed666cc4b3872448adf060129f0ebb5c-1.txt
reporting: tools/rtems-tools-7.cfg -> rtems-tools-da2a7f68ed666cc4b3872448adf060129f0ebb5c-1.xml
cleaning: expat-2.7.3-x86_64-freebsd15.0-1
cleaning: gmp-6.2.1-x86_64-freebsd15.0-1
cleaning: microblaze-rtems7-binutils-7af075d-x86_64-freebsd15.0-1
cleaning: rtems-tools-da2a7f68ed666cc4b3872448adf060129f0ebb5c-1
Build Sizes: usage: 819.156MB total: 582.806MB (sources: 391.244MB, patches: 326.623KB, installed 191.242MB)
Mailing report: build at rtems.org
Report
======
==============================================================================
RTEMS Tools Project <users at rtems.org> Wed Sep 30 14:20:19 2026
==============================================================================
Report: devel/expat-2.7.3-1.cfg
------------------------------------------------------------------------------
RTEMS Source Builder Repository Status
Not a valid GIT repository
=-=-=-=-=-=-=-=-=-=-=-=-=-=-=-=-=-=-=-=-=-=-=-=-=-=-=-=-=-=-=-=-=-=-=-=-=-=-=-
Build Set: (1) devel/expat-2.7.3-1.cfg
=-=-=-=-=-=-=-=-=-=-=-=-=-=-=-=-=-=-=-=-=-=-=-=-=-=-=-=-=-=-=-=-=-=-=-=-=-=-=-
Build Set: (2) devel/expat-2.7.3-1.cfg
------------------------------------------------------------------------------
Package: expat-2.7.3-x86_64-freebsd15.0-1
Config: devel/expat-2.7.3-1.cfg
Summary:
Expat XML Parser v2.7.3 for target microblaze-rtems7 on host x86_64-freebsd15.0
URL:
http://expat.sourceforge.net/
Version:
2.7.3
Release:
1
Sources: 1
1: https://github.com/libexpat/libexpat/releases/download/R_2_7_3/expat-2.7.3.tar.gz
sha512: J0VGwHVaetXbQ6O3IydLohNILWhne6P/D16h3mPN1mAyIU9ujhZ8yEgvfQVqMfOHHCYylUXWVl/uhmFkfph3zg==
Patches: 0
Preparation:
build_top=$(pwd)
%setup source expat -q -n expat-2.7.3
%setup patch expat -p1
cd ${build_top}
Build:
build_top=$(pwd)
cd expat-2.7.3
# Host and build flags, Cross build if host and build are different and
# Cxc build if target is deifned and also different.
# Note, gcc is not ready to be compiled with -std=gnu99 (this needs to be checked).
if test "x86_64-freebsd15.0" != "x86_64-freebsd15.0" ; then
# Cross build
CC=$(echo "x86_64-freebsd15.0-gcc" | sed -e 's,-std=gnu99 ,,')
CXX=$(echo "x86_64-freebsd15.0-g++" | sed -e 's,-std=gnu99 ,,')
CPPFLAGS="${SB_HOST_CPPFLAGS}"
CFLAGS="${SB_HOST_CFLAGS}"
CXXFLAGS="${SB_HOST_CXXFLAGS}"
LDFLAGS="${SB_HOST_LDFLAGS}"
LDLIBS="${SB_HOST_LIBS}"
LIBS="${SB_HOST_LIBS}"
# Host
CPPFLAGS_FOR_HOST="${SB_HOST_CPPFLAGS}"
CFLAGS_FOR_HOST="${SB_HOST_CFLAGS}"
CXXFLAGS_FOR_HOST="${SB_HOST_CXXFLAGS}"
LDFLAGS_FOR_HOST="${SB_HOST_LDFLAGS}"
LDLIBS_FOR_HOST="${SB_HOST_LIBS}"
LIBS_FOR_HOST="${SB_HOST_LIBS}"
CXXFLAGS_FOR_HOST="${SB_HOST_CFLAGS}"
CC_FOR_HOST=$(echo "gcc ${SB_HOST_CFLAGS}" | sed -e 's,-std=gnu99 ,,')
CXX_FOR_HOST=$(echo "g++ ${SB_HOST_CXXFLAGS}" | sed -e 's,-std=gnu99 ,,')
# Build
CFLAGS_FOR_BUILD="${SB_BUILD_CFLAGS}"
CXXFLAGS_FOR_BUILD="${SB_BUILD_CXXFLAGS}"
LDFLAGS_FOR_BUILD="${SB_BUILD_LDFLAGS}"
LDLIBS_FOR_BUILD="${SB_BUILD_LIBS}"
LIBS_FOR_BUILD="${SB_BUILD_LIBS}"
CXXFLAGS_FOR_BUILD="${SB_BUILD_CFLAGS}"
CC_FOR_BUILD=$(echo "/usr/bin/cc ${SB_BUILD_CFLAGS}" | sed -e 's,-std=gnu99 ,,')
CXX_FOR_BUILD=$(echo "/usr/bin/c++ ${SB_BUILD_CXXFLAGS}" | sed -e 's,-std=gnu99 ,,')
else
LDFLAGS="${SB_BUILD_LDFLAGS}"
LDLIBS="${SB_BUILD_LIBS}"
LIBS="${SB_BUILD_LIBS}"
CC=$(echo "/usr/bin/cc ${SB_BUILD_CFLAGS}" | sed -e 's,-std=gnu99 ,,')
CXX=$(echo "/usr/bin/c++ ${SB_BUILD_CXXFLAGS}" | sed -e 's,-std=gnu99 ,,')
CC_FOR_BUILD=${CC}
CXX_FOR_BUILD=${CXX}
fi
export CC CXX CPPFLAGS CFLAGS CXXFLAGS LDFLAGS LIBS LDLIBS
export CC_FOR_HOST CXX_FOR_HOST CPPFLAGS_FOR_HOST CFLAGS_FOR_HOST CXXFLAGS_FOR_HOST LDFLAGS_FOR_HOST LDLIBS_FOR_HOST LIBS_FOR_HOST
export CC_FOR_BUILD CXX_FOR_BUILD CFLAGS_FOR_BUILD CXXFLAGS_FOR_BUILD LDFLAGS_FOR_BUILD LDLIBS_FOR_BUILS LIBS_FOR_BUILS
./configure --build=x86_64-freebsd15.0 --host=x86_64-freebsd15.0 --verbose --prefix=/home/tester/rtems-cron-next/tools/7 --bindir=/home/tester/rtems-cron-next/tools/7/bin --exec-prefix=/home/tester/rtems-cron-next/tools/7 --includedir=/home/tester/rtems-cron-next/tools/7/include --libdir=/home/tester/rtems-cron-next/tools/7/lib --mandir=/home/tester/rtems-cron-next/tools/7/share/man --infodir=/home/tester/rtems-cron-next/tools/7/share/info --without-docbook --disable-shared
gmake -j 6 all
cd ${build_top}
Install:
build_top=$(pwd)
rm -rf $SB_BUILD_ROOT
cd expat-2.7.3
gmake DESTDIR=$SB_BUILD_ROOT install
cd ${build_top}
==============================================================================
RTEMS Tools Project <users at rtems.org> Wed Sep 30 14:20:19 2026
==============================================================================
Report: devel/expat-2.7.3-1.cfg
------------------------------------------------------------------------------
RTEMS Source Builder Repository Status
Not a valid GIT repository
=-=-=-=-=-=-=-=-=-=-=-=-=-=-=-=-=-=-=-=-=-=-=-=-=-=-=-=-=-=-=-=-=-=-=-=-=-=-=-
Build Set: (1) devel/expat-2.7.3-1.cfg
=-=-=-=-=-=-=-=-=-=-=-=-=-=-=-=-=-=-=-=-=-=-=-=-=-=-=-=-=-=-=-=-=-=-=-=-=-=-=-
Build Set: (2) devel/expat-2.7.3-1.cfg
------------------------------------------------------------------------------
Package: expat-2.7.3-x86_64-freebsd15.0-1
Config: devel/expat-2.7.3-1.cfg
Summary:
Expat XML Parser v2.7.3 for target microblaze-rtems7 on host x86_64-freebsd15.0
URL:
http://expat.sourceforge.net/
Version:
2.7.3
Release:
1
Sources: 1
1: https://github.com/libexpat/libexpat/releases/download/R_2_7_3/expat-2.7.3.tar.gz
sha512: J0VGwHVaetXbQ6O3IydLohNILWhne6P/D16h3mPN1mAyIU9ujhZ8yEgvfQVqMfOHHCYylUXWVl/uhmFkfph3zg==
Patches: 0
Preparation:
build_top=$(pwd)
%setup source expat -q -n expat-2.7.3
%setup patch expat -p1
cd ${build_top}
Build:
build_top=$(pwd)
cd expat-2.7.3
# Host and build flags, Cross build if host and build are different and
# Cxc build if target is deifned and also different.
# Note, gcc is not ready to be compiled with -std=gnu99 (this needs to be checked).
if test "x86_64-freebsd15.0" != "x86_64-freebsd15.0" ; then
# Cross build
CC=$(echo "x86_64-freebsd15.0-gcc" | sed -e 's,-std=gnu99 ,,')
CXX=$(echo "x86_64-freebsd15.0-g++" | sed -e 's,-std=gnu99 ,,')
CPPFLAGS="${SB_HOST_CPPFLAGS}"
CFLAGS="${SB_HOST_CFLAGS}"
CXXFLAGS="${SB_HOST_CXXFLAGS}"
LDFLAGS="${SB_HOST_LDFLAGS}"
LDLIBS="${SB_HOST_LIBS}"
LIBS="${SB_HOST_LIBS}"
# Host
CPPFLAGS_FOR_HOST="${SB_HOST_CPPFLAGS}"
CFLAGS_FOR_HOST="${SB_HOST_CFLAGS}"
CXXFLAGS_FOR_HOST="${SB_HOST_CXXFLAGS}"
LDFLAGS_FOR_HOST="${SB_HOST_LDFLAGS}"
LDLIBS_FOR_HOST="${SB_HOST_LIBS}"
LIBS_FOR_HOST="${SB_HOST_LIBS}"
CXXFLAGS_FOR_HOST="${SB_HOST_CFLAGS}"
CC_FOR_HOST=$(echo "gcc ${SB_HOST_CFLAGS}" | sed -e 's,-std=gnu99 ,,')
CXX_FOR_HOST=$(echo "g++ ${SB_HOST_CXXFLAGS}" | sed -e 's,-std=gnu99 ,,')
# Build
CFLAGS_FOR_BUILD="${SB_BUILD_CFLAGS}"
CXXFLAGS_FOR_BUILD="${SB_BUILD_CXXFLAGS}"
LDFLAGS_FOR_BUILD="${SB_BUILD_LDFLAGS}"
LDLIBS_FOR_BUILD="${SB_BUILD_LIBS}"
LIBS_FOR_BUILD="${SB_BUILD_LIBS}"
CXXFLAGS_FOR_BUILD="${SB_BUILD_CFLAGS}"
CC_FOR_BUILD=$(echo "/usr/bin/cc ${SB_BUILD_CFLAGS}" | sed -e 's,-std=gnu99 ,,')
CXX_FOR_BUILD=$(echo "/usr/bin/c++ ${SB_BUILD_CXXFLAGS}" | sed -e 's,-std=gnu99 ,,')
else
LDFLAGS="${SB_BUILD_LDFLAGS}"
LDLIBS="${SB_BUILD_LIBS}"
LIBS="${SB_BUILD_LIBS}"
CC=$(echo "/usr/bin/cc ${SB_BUILD_CFLAGS}" | sed -e 's,-std=gnu99 ,,')
CXX=$(echo "/usr/bin/c++ ${SB_BUILD_CXXFLAGS}" | sed -e 's,-std=gnu99 ,,')
CC_FOR_BUILD=${CC}
CXX_FOR_BUILD=${CXX}
fi
export CC CXX CPPFLAGS CFLAGS CXXFLAGS LDFLAGS LIBS LDLIBS
export CC_FOR_HOST CXX_FOR_HOST CPPFLAGS_FOR_HOST CFLAGS_FOR_HOST CXXFLAGS_FOR_HOST LDFLAGS_FOR_HOST LDLIBS_FOR_HOST LIBS_FOR_HOST
export CC_FOR_BUILD CXX_FOR_BUILD CFLAGS_FOR_BUILD CXXFLAGS_FOR_BUILD LDFLAGS_FOR_BUILD LDLIBS_FOR_BUILS LIBS_FOR_BUILS
./configure --build=x86_64-freebsd15.0 --host=x86_64-freebsd15.0 --verbose --prefix=/home/tester/rtems-cron-next/tools/7 --bindir=/home/tester/rtems-cron-next/tools/7/bin --exec-prefix=/home/tester/rtems-cron-next/tools/7 --includedir=/home/tester/rtems-cron-next/tools/7/include --libdir=/home/tester/rtems-cron-next/tools/7/lib --mandir=/home/tester/rtems-cron-next/tools/7/share/man --infodir=/home/tester/rtems-cron-next/tools/7/share/info --without-docbook --disable-shared
gmake -j 6 all
cd ${build_top}
Install:
build_top=$(pwd)
rm -rf $SB_BUILD_ROOT
cd expat-2.7.3
gmake DESTDIR=$SB_BUILD_ROOT install
cd ${build_top}
==============================================================================
RTEMS Tools Project <users at rtems.org> Wed Sep 30 14:20:53 2026
==============================================================================
Report: devel/gmp-6.2.1.cfg
------------------------------------------------------------------------------
RTEMS Source Builder Repository Status
Not a valid GIT repository
=-=-=-=-=-=-=-=-=-=-=-=-=-=-=-=-=-=-=-=-=-=-=-=-=-=-=-=-=-=-=-=-=-=-=-=-=-=-=-
Build Set: (1) devel/gmp-6.2.1.cfg
=-=-=-=-=-=-=-=-=-=-=-=-=-=-=-=-=-=-=-=-=-=-=-=-=-=-=-=-=-=-=-=-=-=-=-=-=-=-=-
Build Set: (2) devel/gmp-6.2.1.cfg
------------------------------------------------------------------------------
Package: gmp-6.2.1-x86_64-freebsd15.0-1
Config: devel/gmp-6.2.1.cfg
Summary:
The GNU Multiple Precision Arithmetic Library (GMP) v6.2.1 for target microblaze-rtems7 on host x86_64-freebsd15.0
URL:
https://gmplib.org/
Version:
6.2.1
Release:
1
Sources: 1
1: https://gcc.gnu.org/pub/gcc/infrastructure/gmp-6.2.1.tar.bz2
sha512: iQQzSjvMXIluzsq8dc2p3sZC5AH7U5fEmSxPq+peliyc6L1E6OQjPDTlXIAQzCjbBUX191DL27XwCvU43HY76Q==
Patches: 0
Preparation:
build_top=$(pwd)
%setup source gmp -q -n gmp-6.2.1
%setup patch gmp -p1
cd ${build_top}
Build:
build_top=$(pwd)
cd gmp-6.2.1
# Host and build flags, Cross build if host and build are different and
# Cxc build if target is deifned and also different.
# Note, gcc is not ready to be compiled with -std=gnu99 (this needs to be checked).
if test "x86_64-freebsd15.0" != "x86_64-freebsd15.0" ; then
# Cross build
CC=$(echo "x86_64-freebsd15.0-gcc" | sed -e 's,-std=gnu99 ,,')
CXX=$(echo "x86_64-freebsd15.0-g++" | sed -e 's,-std=gnu99 ,,')
CPPFLAGS="${SB_HOST_CPPFLAGS}"
CFLAGS="${SB_HOST_CFLAGS}"
CXXFLAGS="${SB_HOST_CXXFLAGS}"
LDFLAGS="${SB_HOST_LDFLAGS}"
LDLIBS="${SB_HOST_LIBS}"
LIBS="${SB_HOST_LIBS}"
# Host
CPPFLAGS_FOR_HOST="${SB_HOST_CPPFLAGS}"
CFLAGS_FOR_HOST="${SB_HOST_CFLAGS}"
CXXFLAGS_FOR_HOST="${SB_HOST_CXXFLAGS}"
LDFLAGS_FOR_HOST="${SB_HOST_LDFLAGS}"
LDLIBS_FOR_HOST="${SB_HOST_LIBS}"
LIBS_FOR_HOST="${SB_HOST_LIBS}"
CXXFLAGS_FOR_HOST="${SB_HOST_CFLAGS}"
CC_FOR_HOST=$(echo "gcc ${SB_HOST_CFLAGS}" | sed -e 's,-std=gnu99 ,,')
CXX_FOR_HOST=$(echo "g++ ${SB_HOST_CXXFLAGS}" | sed -e 's,-std=gnu99 ,,')
# Build
CFLAGS_FOR_BUILD="${SB_BUILD_CFLAGS}"
CXXFLAGS_FOR_BUILD="${SB_BUILD_CXXFLAGS}"
LDFLAGS_FOR_BUILD="${SB_BUILD_LDFLAGS}"
LDLIBS_FOR_BUILD="${SB_BUILD_LIBS}"
LIBS_FOR_BUILD="${SB_BUILD_LIBS}"
CXXFLAGS_FOR_BUILD="${SB_BUILD_CFLAGS}"
CC_FOR_BUILD=$(echo "/usr/bin/cc ${SB_BUILD_CFLAGS}" | sed -e 's,-std=gnu99 ,,')
CXX_FOR_BUILD=$(echo "/usr/bin/c++ ${SB_BUILD_CXXFLAGS}" | sed -e 's,-std=gnu99 ,,')
else
LDFLAGS="${SB_BUILD_LDFLAGS}"
LDLIBS="${SB_BUILD_LIBS}"
LIBS="${SB_BUILD_LIBS}"
CC=$(echo "/usr/bin/cc ${SB_BUILD_CFLAGS}" | sed -e 's,-std=gnu99 ,,')
CXX=$(echo "/usr/bin/c++ ${SB_BUILD_CXXFLAGS}" | sed -e 's,-std=gnu99 ,,')
CC_FOR_BUILD=${CC}
CXX_FOR_BUILD=${CXX}
fi
export CC CXX CPPFLAGS CFLAGS CXXFLAGS LDFLAGS LIBS LDLIBS
export CC_FOR_HOST CXX_FOR_HOST CPPFLAGS_FOR_HOST CFLAGS_FOR_HOST CXXFLAGS_FOR_HOST LDFLAGS_FOR_HOST LDLIBS_FOR_HOST LIBS_FOR_HOST
export CC_FOR_BUILD CXX_FOR_BUILD CFLAGS_FOR_BUILD CXXFLAGS_FOR_BUILD LDFLAGS_FOR_BUILD LDLIBS_FOR_BUILS LIBS_FOR_BUILS
./configure --build=x86_64-freebsd15.0 --host=x86_64-freebsd15.0 --verbose --prefix=/home/tester/rtems-cron-next/tools/7 --bindir=/home/tester/rtems-cron-next/tools/7/bin --exec-prefix=/home/tester/rtems-cron-next/tools/7 --includedir=/home/tester/rtems-cron-next/tools/7/include --libdir=/home/tester/rtems-cron-next/tools/7/lib --mandir=/home/tester/rtems-cron-next/tools/7/share/man --infodir=/home/tester/rtems-cron-next/tools/7/share/info --disable-shared
gmake -j 6 all
cd ${build_top}
Install:
build_top=$(pwd)
rm -rf $SB_BUILD_ROOT
cd gmp-6.2.1
gmake DESTDIR=$SB_BUILD_ROOT install
cd ${build_top}
==============================================================================
RTEMS Tools Project <users at rtems.org> Wed Sep 30 14:20:53 2026
==============================================================================
Report: devel/gmp-6.2.1.cfg
------------------------------------------------------------------------------
RTEMS Source Builder Repository Status
Not a valid GIT repository
=-=-=-=-=-=-=-=-=-=-=-=-=-=-=-=-=-=-=-=-=-=-=-=-=-=-=-=-=-=-=-=-=-=-=-=-=-=-=-
Build Set: (1) devel/gmp-6.2.1.cfg
=-=-=-=-=-=-=-=-=-=-=-=-=-=-=-=-=-=-=-=-=-=-=-=-=-=-=-=-=-=-=-=-=-=-=-=-=-=-=-
Build Set: (2) devel/gmp-6.2.1.cfg
------------------------------------------------------------------------------
Package: gmp-6.2.1-x86_64-freebsd15.0-1
Config: devel/gmp-6.2.1.cfg
Summary:
The GNU Multiple Precision Arithmetic Library (GMP) v6.2.1 for target microblaze-rtems7 on host x86_64-freebsd15.0
URL:
https://gmplib.org/
Version:
6.2.1
Release:
1
Sources: 1
1: https://gcc.gnu.org/pub/gcc/infrastructure/gmp-6.2.1.tar.bz2
sha512: iQQzSjvMXIluzsq8dc2p3sZC5AH7U5fEmSxPq+peliyc6L1E6OQjPDTlXIAQzCjbBUX191DL27XwCvU43HY76Q==
Patches: 0
Preparation:
build_top=$(pwd)
%setup source gmp -q -n gmp-6.2.1
%setup patch gmp -p1
cd ${build_top}
Build:
build_top=$(pwd)
cd gmp-6.2.1
# Host and build flags, Cross build if host and build are different and
# Cxc build if target is deifned and also different.
# Note, gcc is not ready to be compiled with -std=gnu99 (this needs to be checked).
if test "x86_64-freebsd15.0" != "x86_64-freebsd15.0" ; then
# Cross build
CC=$(echo "x86_64-freebsd15.0-gcc" | sed -e 's,-std=gnu99 ,,')
CXX=$(echo "x86_64-freebsd15.0-g++" | sed -e 's,-std=gnu99 ,,')
CPPFLAGS="${SB_HOST_CPPFLAGS}"
CFLAGS="${SB_HOST_CFLAGS}"
CXXFLAGS="${SB_HOST_CXXFLAGS}"
LDFLAGS="${SB_HOST_LDFLAGS}"
LDLIBS="${SB_HOST_LIBS}"
LIBS="${SB_HOST_LIBS}"
# Host
CPPFLAGS_FOR_HOST="${SB_HOST_CPPFLAGS}"
CFLAGS_FOR_HOST="${SB_HOST_CFLAGS}"
CXXFLAGS_FOR_HOST="${SB_HOST_CXXFLAGS}"
LDFLAGS_FOR_HOST="${SB_HOST_LDFLAGS}"
LDLIBS_FOR_HOST="${SB_HOST_LIBS}"
LIBS_FOR_HOST="${SB_HOST_LIBS}"
CXXFLAGS_FOR_HOST="${SB_HOST_CFLAGS}"
CC_FOR_HOST=$(echo "gcc ${SB_HOST_CFLAGS}" | sed -e 's,-std=gnu99 ,,')
CXX_FOR_HOST=$(echo "g++ ${SB_HOST_CXXFLAGS}" | sed -e 's,-std=gnu99 ,,')
# Build
CFLAGS_FOR_BUILD="${SB_BUILD_CFLAGS}"
CXXFLAGS_FOR_BUILD="${SB_BUILD_CXXFLAGS}"
LDFLAGS_FOR_BUILD="${SB_BUILD_LDFLAGS}"
LDLIBS_FOR_BUILD="${SB_BUILD_LIBS}"
LIBS_FOR_BUILD="${SB_BUILD_LIBS}"
CXXFLAGS_FOR_BUILD="${SB_BUILD_CFLAGS}"
CC_FOR_BUILD=$(echo "/usr/bin/cc ${SB_BUILD_CFLAGS}" | sed -e 's,-std=gnu99 ,,')
CXX_FOR_BUILD=$(echo "/usr/bin/c++ ${SB_BUILD_CXXFLAGS}" | sed -e 's,-std=gnu99 ,,')
else
LDFLAGS="${SB_BUILD_LDFLAGS}"
LDLIBS="${SB_BUILD_LIBS}"
LIBS="${SB_BUILD_LIBS}"
CC=$(echo "/usr/bin/cc ${SB_BUILD_CFLAGS}" | sed -e 's,-std=gnu99 ,,')
CXX=$(echo "/usr/bin/c++ ${SB_BUILD_CXXFLAGS}" | sed -e 's,-std=gnu99 ,,')
CC_FOR_BUILD=${CC}
CXX_FOR_BUILD=${CXX}
fi
export CC CXX CPPFLAGS CFLAGS CXXFLAGS LDFLAGS LIBS LDLIBS
export CC_FOR_HOST CXX_FOR_HOST CPPFLAGS_FOR_HOST CFLAGS_FOR_HOST CXXFLAGS_FOR_HOST LDFLAGS_FOR_HOST LDLIBS_FOR_HOST LIBS_FOR_HOST
export CC_FOR_BUILD CXX_FOR_BUILD CFLAGS_FOR_BUILD CXXFLAGS_FOR_BUILD LDFLAGS_FOR_BUILD LDLIBS_FOR_BUILS LIBS_FOR_BUILS
./configure --build=x86_64-freebsd15.0 --host=x86_64-freebsd15.0 --verbose --prefix=/home/tester/rtems-cron-next/tools/7 --bindir=/home/tester/rtems-cron-next/tools/7/bin --exec-prefix=/home/tester/rtems-cron-next/tools/7 --includedir=/home/tester/rtems-cron-next/tools/7/include --libdir=/home/tester/rtems-cron-next/tools/7/lib --mandir=/home/tester/rtems-cron-next/tools/7/share/man --infodir=/home/tester/rtems-cron-next/tools/7/share/info --disable-shared
gmake -j 6 all
cd ${build_top}
Install:
build_top=$(pwd)
rm -rf $SB_BUILD_ROOT
cd gmp-6.2.1
gmake DESTDIR=$SB_BUILD_ROOT install
cd ${build_top}
==============================================================================
RTEMS Tools Project <users at rtems.org> Wed Sep 30 14:22:32 2026
==============================================================================
Report: tools/rtems-xilinx-binutils-2.36.cfg
------------------------------------------------------------------------------
RTEMS Source Builder Repository Status
Not a valid GIT repository
=-=-=-=-=-=-=-=-=-=-=-=-=-=-=-=-=-=-=-=-=-=-=-=-=-=-=-=-=-=-=-=-=-=-=-=-=-=-=-
Build Set: (1) tools/rtems-xilinx-binutils-2.36.cfg
=-=-=-=-=-=-=-=-=-=-=-=-=-=-=-=-=-=-=-=-=-=-=-=-=-=-=-=-=-=-=-=-=-=-=-=-=-=-=-
Build Set: (2) tools/rtems-xilinx-binutils-2.36.cfg
------------------------------------------------------------------------------
Package: microblaze-rtems7-binutils-7af075d-x86_64-freebsd15.0-1
Config: tools/rtems-xilinx-binutils-2.36.cfg
Summary:
Binutils v7af075d for target microblaze-rtems7 on host x86_64-freebsd15.0
URL:
http://sources.redhat.com/binutils
Version:
7af075d
Release:
1
Sources: 1
1: --rsb-file=binutils-gdb-7af075d.tar.gz https://gitlab.rtems.org/contrib/binutils-gdb/-/archive/7af075d/binutils-gdb-7af075d.tar.gz
sha512: /k71xu5pT5qvkUpnckDVyBMtLYgWdtQHSF4MYBpfyenlrHw4UN8RB5k7OPMEuvmhKtizGzzRvPRrcHB4RVuJMA==
Patches: 0
Preparation:
build_top=$(pwd)
binutils_source=binutils-gdb-7af075d
source_dir_binutils=${binutils_source}
%setup source binutils -q -n ${binutils_source}
%setup patch binutils -p1
cd ${build_top}
Build:
build_top=$(pwd)
if test "x86_64-freebsd15.0" != "x86_64-freebsd15.0" ; then
# Cross-build (Xc) if no target or the host and target match.
# Canadian-cross (Cxc) if build, host and target are all different.
if test -z "microblaze-rtems7" -o "x86_64-freebsd15.0" == "microblaze-rtems7" ; then
build_dir="build-xc"
else
build_dir="build-cxc"
fi
else
build_dir="build"
fi
mkdir -p ${build_dir}
cd ${build_dir}
# Host and build flags, Cross build if host and build are different and
# Cxc build if target is deifned and also different.
# Note, gcc is not ready to be compiled with -std=gnu99 (this needs to be checked).
if test "x86_64-freebsd15.0" != "x86_64-freebsd15.0" ; then
# Cross build
CC=$(echo "x86_64-freebsd15.0-gcc" | sed -e 's,-std=gnu99 ,,')
CXX=$(echo "x86_64-freebsd15.0-g++" | sed -e 's,-std=gnu99 ,,')
CPPFLAGS="${SB_HOST_CPPFLAGS}"
CFLAGS="${SB_HOST_CFLAGS}"
CXXFLAGS="${SB_HOST_CXXFLAGS}"
LDFLAGS="${SB_HOST_LDFLAGS}"
LDLIBS="${SB_HOST_LIBS}"
LIBS="${SB_HOST_LIBS}"
# Host
CPPFLAGS_FOR_HOST="${SB_HOST_CPPFLAGS}"
CFLAGS_FOR_HOST="${SB_HOST_CFLAGS}"
CXXFLAGS_FOR_HOST="${SB_HOST_CXXFLAGS}"
LDFLAGS_FOR_HOST="${SB_HOST_LDFLAGS}"
LDLIBS_FOR_HOST="${SB_HOST_LIBS}"
LIBS_FOR_HOST="${SB_HOST_LIBS}"
CXXFLAGS_FOR_HOST="${SB_HOST_CFLAGS}"
CC_FOR_HOST=$(echo "gcc ${SB_HOST_CFLAGS}" | sed -e 's,-std=gnu99 ,,')
CXX_FOR_HOST=$(echo "g++ ${SB_HOST_CXXFLAGS}" | sed -e 's,-std=gnu99 ,,')
# Build
CFLAGS_FOR_BUILD="${SB_BUILD_CFLAGS}"
CXXFLAGS_FOR_BUILD="${SB_BUILD_CXXFLAGS}"
LDFLAGS_FOR_BUILD="${SB_BUILD_LDFLAGS}"
LDLIBS_FOR_BUILD="${SB_BUILD_LIBS}"
LIBS_FOR_BUILD="${SB_BUILD_LIBS}"
CXXFLAGS_FOR_BUILD="${SB_BUILD_CFLAGS}"
CC_FOR_BUILD=$(echo "/usr/bin/cc ${SB_BUILD_CFLAGS}" | sed -e 's,-std=gnu99 ,,')
CXX_FOR_BUILD=$(echo "/usr/bin/c++ ${SB_BUILD_CXXFLAGS}" | sed -e 's,-std=gnu99 ,,')
else
LDFLAGS="${SB_BUILD_LDFLAGS}"
LDLIBS="${SB_BUILD_LIBS}"
LIBS="${SB_BUILD_LIBS}"
CC=$(echo "/usr/bin/cc ${SB_BUILD_CFLAGS}" | sed -e 's,-std=gnu99 ,,')
CXX=$(echo "/usr/bin/c++ ${SB_BUILD_CXXFLAGS}" | sed -e 's,-std=gnu99 ,,')
CC_FOR_BUILD=${CC}
CXX_FOR_BUILD=${CXX}
fi
export CC CXX CPPFLAGS CFLAGS CXXFLAGS LDFLAGS LIBS LDLIBS
export CC_FOR_HOST CXX_FOR_HOST CPPFLAGS_FOR_HOST CFLAGS_FOR_HOST CXXFLAGS_FOR_HOST LDFLAGS_FOR_HOST LDLIBS_FOR_HOST LIBS_FOR_HOST
export CC_FOR_BUILD CXX_FOR_BUILD CFLAGS_FOR_BUILD CXXFLAGS_FOR_BUILD LDFLAGS_FOR_BUILD LDLIBS_FOR_BUILS LIBS_FOR_BUILS
../${source_dir_binutils}/configure --build=x86_64-freebsd15.0 --host=x86_64-freebsd15.0 --target=microblaze-rtems7 --verbose --disable-nls --disable-gdb --disable-libdecnumber --disable-readline --disable-sim --enable-deterministic-archives --enable-64-bit-bfd --without-included-gettext --disable-win32-registry --disable-werror --prefix=/home/tester/rtems-cron-next/tools/7 --bindir=/home/tester/rtems-cron-next/tools/7/bin --exec-prefix=/home/tester/rtems-cron-next/tools/7 --includedir=/home/tester/rtems-cron-next/tools/7/include --libdir=/home/tester/rtems-cron-next/tools/7/lib --mandir=/home/tester/rtems-cron-next/tools/7/share/man --infodir=/home/tester/rtems-cron-next/tools/7/share/info --disable-warn-execstack --disable-warn-rwx-segments
gmake -j 6 all
cd ${build_top}
Install:
cd ${build_top}
/bin/rm -rf $SB_BUILD_ROOT
cd ${build_dir}
gmake DESTDIR=$SB_BUILD_ROOT install
/bin/rm -rf $SB_BUILD_ROOT/home/tester/rtems-cron-next/tools/7/share/info/configure.info*
/bin/rm -f $SB_BUILD_ROOT/home/tester/rtems-cron-next/tools/7/share/info/dir
touch $SB_BUILD_ROOT/home/tester/rtems-cron-next/tools/7/share/info/dir
mkdir -p $SB_BUILD_ROOT/home/tester/rtems-cron-next/tools/7/share/locale
/bin/rm -f ${SB_BUILD_ROOT}/home/tester/rtems-cron-next/tools/7/lib/libiberty*
if test ! -f ${SB_BUILD_ROOT}/home/tester/rtems-cron-next/tools/7/bin/microblaze-rtems7-dlltool; then
/bin/rm -f ${SB_BUILD_ROOT}/home/tester/rtems-cron-next/tools/7/share/man/man1/microblaze-rtems7-dlltool*
fi
if test ! -f ${SB_BUILD_ROOT}/home/tester/rtems-cron-next/tools/7/bin/microblaze-rtems7-nlmconv; then
/bin/rm -f ${SB_BUILD_ROOT}/home/tester/rtems-cron-next/tools/7/share/man/man1/microblaze-rtems7-nlmconv*
fi
if test ! -f ${SB_BUILD_ROOT}/home/tester/rtems-cron-next/tools/7/bin/microblaze-rtems7-windres; then
/bin/rm -f ${SB_BUILD_ROOT}/home/tester/rtems-cron-next/tools/7/share/man/man1/microblaze-rtems7-windres*
fi
if test ! -f ${SB_BUILD_ROOT}/home/tester/rtems-cron-next/tools/7/bin/microblaze-rtems7-windmc; then
/bin/rm -f ${SB_BUILD_ROOT}/home/tester/rtems-cron-next/tools/7/share/man/man1/microblaze-rtems7-windmc*
fi
cd ${build_top}
==============================================================================
RTEMS Tools Project <users at rtems.org> Wed Sep 30 14:22:32 2026
==============================================================================
Report: tools/rtems-xilinx-binutils-2.36.cfg
------------------------------------------------------------------------------
RTEMS Source Builder Repository Status
Not a valid GIT repository
=-=-=-=-=-=-=-=-=-=-=-=-=-=-=-=-=-=-=-=-=-=-=-=-=-=-=-=-=-=-=-=-=-=-=-=-=-=-=-
Build Set: (1) tools/rtems-xilinx-binutils-2.36.cfg
=-=-=-=-=-=-=-=-=-=-=-=-=-=-=-=-=-=-=-=-=-=-=-=-=-=-=-=-=-=-=-=-=-=-=-=-=-=-=-
Build Set: (2) tools/rtems-xilinx-binutils-2.36.cfg
------------------------------------------------------------------------------
Package: microblaze-rtems7-binutils-7af075d-x86_64-freebsd15.0-1
Config: tools/rtems-xilinx-binutils-2.36.cfg
Summary:
Binutils v7af075d for target microblaze-rtems7 on host x86_64-freebsd15.0
URL:
http://sources.redhat.com/binutils
Version:
7af075d
Release:
1
Sources: 1
1: --rsb-file=binutils-gdb-7af075d.tar.gz https://gitlab.rtems.org/contrib/binutils-gdb/-/archive/7af075d/binutils-gdb-7af075d.tar.gz
sha512: /k71xu5pT5qvkUpnckDVyBMtLYgWdtQHSF4MYBpfyenlrHw4UN8RB5k7OPMEuvmhKtizGzzRvPRrcHB4RVuJMA==
Patches: 0
Preparation:
build_top=$(pwd)
binutils_source=binutils-gdb-7af075d
source_dir_binutils=${binutils_source}
%setup source binutils -q -n ${binutils_source}
%setup patch binutils -p1
cd ${build_top}
Build:
build_top=$(pwd)
if test "x86_64-freebsd15.0" != "x86_64-freebsd15.0" ; then
# Cross-build (Xc) if no target or the host and target match.
# Canadian-cross (Cxc) if build, host and target are all different.
if test -z "microblaze-rtems7" -o "x86_64-freebsd15.0" == "microblaze-rtems7" ; then
build_dir="build-xc"
else
build_dir="build-cxc"
fi
else
build_dir="build"
fi
mkdir -p ${build_dir}
cd ${build_dir}
# Host and build flags, Cross build if host and build are different and
# Cxc build if target is deifned and also different.
# Note, gcc is not ready to be compiled with -std=gnu99 (this needs to be checked).
if test "x86_64-freebsd15.0" != "x86_64-freebsd15.0" ; then
# Cross build
CC=$(echo "x86_64-freebsd15.0-gcc" | sed -e 's,-std=gnu99 ,,')
CXX=$(echo "x86_64-freebsd15.0-g++" | sed -e 's,-std=gnu99 ,,')
CPPFLAGS="${SB_HOST_CPPFLAGS}"
CFLAGS="${SB_HOST_CFLAGS}"
CXXFLAGS="${SB_HOST_CXXFLAGS}"
LDFLAGS="${SB_HOST_LDFLAGS}"
LDLIBS="${SB_HOST_LIBS}"
LIBS="${SB_HOST_LIBS}"
# Host
CPPFLAGS_FOR_HOST="${SB_HOST_CPPFLAGS}"
CFLAGS_FOR_HOST="${SB_HOST_CFLAGS}"
CXXFLAGS_FOR_HOST="${SB_HOST_CXXFLAGS}"
LDFLAGS_FOR_HOST="${SB_HOST_LDFLAGS}"
LDLIBS_FOR_HOST="${SB_HOST_LIBS}"
LIBS_FOR_HOST="${SB_HOST_LIBS}"
CXXFLAGS_FOR_HOST="${SB_HOST_CFLAGS}"
CC_FOR_HOST=$(echo "gcc ${SB_HOST_CFLAGS}" | sed -e 's,-std=gnu99 ,,')
CXX_FOR_HOST=$(echo "g++ ${SB_HOST_CXXFLAGS}" | sed -e 's,-std=gnu99 ,,')
# Build
CFLAGS_FOR_BUILD="${SB_BUILD_CFLAGS}"
CXXFLAGS_FOR_BUILD="${SB_BUILD_CXXFLAGS}"
LDFLAGS_FOR_BUILD="${SB_BUILD_LDFLAGS}"
LDLIBS_FOR_BUILD="${SB_BUILD_LIBS}"
LIBS_FOR_BUILD="${SB_BUILD_LIBS}"
CXXFLAGS_FOR_BUILD="${SB_BUILD_CFLAGS}"
CC_FOR_BUILD=$(echo "/usr/bin/cc ${SB_BUILD_CFLAGS}" | sed -e 's,-std=gnu99 ,,')
CXX_FOR_BUILD=$(echo "/usr/bin/c++ ${SB_BUILD_CXXFLAGS}" | sed -e 's,-std=gnu99 ,,')
else
LDFLAGS="${SB_BUILD_LDFLAGS}"
LDLIBS="${SB_BUILD_LIBS}"
LIBS="${SB_BUILD_LIBS}"
CC=$(echo "/usr/bin/cc ${SB_BUILD_CFLAGS}" | sed -e 's,-std=gnu99 ,,')
CXX=$(echo "/usr/bin/c++ ${SB_BUILD_CXXFLAGS}" | sed -e 's,-std=gnu99 ,,')
CC_FOR_BUILD=${CC}
CXX_FOR_BUILD=${CXX}
fi
export CC CXX CPPFLAGS CFLAGS CXXFLAGS LDFLAGS LIBS LDLIBS
export CC_FOR_HOST CXX_FOR_HOST CPPFLAGS_FOR_HOST CFLAGS_FOR_HOST CXXFLAGS_FOR_HOST LDFLAGS_FOR_HOST LDLIBS_FOR_HOST LIBS_FOR_HOST
export CC_FOR_BUILD CXX_FOR_BUILD CFLAGS_FOR_BUILD CXXFLAGS_FOR_BUILD LDFLAGS_FOR_BUILD LDLIBS_FOR_BUILS LIBS_FOR_BUILS
../${source_dir_binutils}/configure --build=x86_64-freebsd15.0 --host=x86_64-freebsd15.0 --target=microblaze-rtems7 --verbose --disable-nls --disable-gdb --disable-libdecnumber --disable-readline --disable-sim --enable-deterministic-archives --enable-64-bit-bfd --without-included-gettext --disable-win32-registry --disable-werror --prefix=/home/tester/rtems-cron-next/tools/7 --bindir=/home/tester/rtems-cron-next/tools/7/bin --exec-prefix=/home/tester/rtems-cron-next/tools/7 --includedir=/home/tester/rtems-cron-next/tools/7/include --libdir=/home/tester/rtems-cron-next/tools/7/lib --mandir=/home/tester/rtems-cron-next/tools/7/share/man --infodir=/home/tester/rtems-cron-next/tools/7/share/info --disable-warn-execstack --disable-warn-rwx-segments
gmake -j 6 all
cd ${build_top}
Install:
cd ${build_top}
/bin/rm -rf $SB_BUILD_ROOT
cd ${build_dir}
gmake DESTDIR=$SB_BUILD_ROOT install
/bin/rm -rf $SB_BUILD_ROOT/home/tester/rtems-cron-next/tools/7/share/info/configure.info*
/bin/rm -f $SB_BUILD_ROOT/home/tester/rtems-cron-next/tools/7/share/info/dir
touch $SB_BUILD_ROOT/home/tester/rtems-cron-next/tools/7/share/info/dir
mkdir -p $SB_BUILD_ROOT/home/tester/rtems-cron-next/tools/7/share/locale
/bin/rm -f ${SB_BUILD_ROOT}/home/tester/rtems-cron-next/tools/7/lib/libiberty*
if test ! -f ${SB_BUILD_ROOT}/home/tester/rtems-cron-next/tools/7/bin/microblaze-rtems7-dlltool; then
/bin/rm -f ${SB_BUILD_ROOT}/home/tester/rtems-cron-next/tools/7/share/man/man1/microblaze-rtems7-dlltool*
fi
if test ! -f ${SB_BUILD_ROOT}/home/tester/rtems-cron-next/tools/7/bin/microblaze-rtems7-nlmconv; then
/bin/rm -f ${SB_BUILD_ROOT}/home/tester/rtems-cron-next/tools/7/share/man/man1/microblaze-rtems7-nlmconv*
fi
if test ! -f ${SB_BUILD_ROOT}/home/tester/rtems-cron-next/tools/7/bin/microblaze-rtems7-windres; then
/bin/rm -f ${SB_BUILD_ROOT}/home/tester/rtems-cron-next/tools/7/share/man/man1/microblaze-rtems7-windres*
fi
if test ! -f ${SB_BUILD_ROOT}/home/tester/rtems-cron-next/tools/7/bin/microblaze-rtems7-windmc; then
/bin/rm -f ${SB_BUILD_ROOT}/home/tester/rtems-cron-next/tools/7/share/man/man1/microblaze-rtems7-windmc*
fi
cd ${build_top}
==============================================================================
RTEMS Tools Project <users at rtems.org> Wed Sep 30 14:24:39 2026
==============================================================================
Report: tools/rtems-tools-7.cfg
------------------------------------------------------------------------------
RTEMS Source Builder Repository Status
Not a valid GIT repository
=-=-=-=-=-=-=-=-=-=-=-=-=-=-=-=-=-=-=-=-=-=-=-=-=-=-=-=-=-=-=-=-=-=-=-=-=-=-=-
Build Set: (1) tools/rtems-tools-7.cfg
=-=-=-=-=-=-=-=-=-=-=-=-=-=-=-=-=-=-=-=-=-=-=-=-=-=-=-=-=-=-=-=-=-=-=-=-=-=-=-
Build Set: (2) tools/rtems-tools-7.cfg
------------------------------------------------------------------------------
Package: rtems-tools-da2a7f68ed666cc4b3872448adf060129f0ebb5c-1
Config: tools/rtems-tools-7.cfg
Summary:
RTEMS Tools da2a7f68ed666cc4b3872448adf060129f0ebb5c for host x86_64-freebsd15.0
URL:
http://www.rtems.org/
Version:
da2a7f68ed666cc4b3872448adf060129f0ebb5c
Release:
1
Sources: 1
1: https://gitlab.rtems.org/rtems/tools/rtems-tools/-/archive/da2a7f68ed666cc4b3872448adf060129f0ebb5c/rtems-tools-da2a7f68ed666cc4b3872448adf060129f0ebb5c.tar.bz2
sha512: Lg0dk9d64qF6CoRcjCtI2Wc2kW8Pw6iwB2nH3FfNcfpXw9p2ikaX9SONqlMER0Hg1Ghn0RFetWeVQubwrPiDDA==
Patches: 0
Preparation:
build_top=$(pwd)
rtems_tools_source=rtems-tools-da2a7f68ed666cc4b3872448adf060129f0ebb5c
source_dir_rtems_tools=${rtems_tools_source}
%setup source rtems-tools -q -n ${rtems_tools_source}
%setup patch rtems-tools -p1
cd ${build_top}
Build:
build_top=$(pwd)
if test "x86_64-freebsd15.0" != "x86_64-freebsd15.0" ; then
RT_HOST="--host=x86_64-freebsd15.0"
else
RT_HOST=
fi
cd ${source_dir_rtems_tools}
./waf distclean configure ${RT_HOST} --prefix=/home/tester/rtems-cron-next/tools/7
./waf
cd ${build_top}
Install:
build_top=$(pwd)
/bin/rm -rf $SB_BUILD_ROOT
cd ${source_dir_rtems_tools}
./waf --destdir=$SB_BUILD_ROOT install
cd ${build_top}
==============================================================================
RTEMS Tools Project <users at rtems.org> Wed Sep 30 14:24:39 2026
==============================================================================
Report: tools/rtems-tools-7.cfg
------------------------------------------------------------------------------
RTEMS Source Builder Repository Status
Not a valid GIT repository
=-=-=-=-=-=-=-=-=-=-=-=-=-=-=-=-=-=-=-=-=-=-=-=-=-=-=-=-=-=-=-=-=-=-=-=-=-=-=-
Build Set: (1) tools/rtems-tools-7.cfg
=-=-=-=-=-=-=-=-=-=-=-=-=-=-=-=-=-=-=-=-=-=-=-=-=-=-=-=-=-=-=-=-=-=-=-=-=-=-=-
Build Set: (2) tools/rtems-tools-7.cfg
------------------------------------------------------------------------------
Package: rtems-tools-da2a7f68ed666cc4b3872448adf060129f0ebb5c-1
Config: tools/rtems-tools-7.cfg
Summary:
RTEMS Tools da2a7f68ed666cc4b3872448adf060129f0ebb5c for host x86_64-freebsd15.0
URL:
http://www.rtems.org/
Version:
da2a7f68ed666cc4b3872448adf060129f0ebb5c
Release:
1
Sources: 1
1: https://gitlab.rtems.org/rtems/tools/rtems-tools/-/archive/da2a7f68ed666cc4b3872448adf060129f0ebb5c/rtems-tools-da2a7f68ed666cc4b3872448adf060129f0ebb5c.tar.bz2
sha512: Lg0dk9d64qF6CoRcjCtI2Wc2kW8Pw6iwB2nH3FfNcfpXw9p2ikaX9SONqlMER0Hg1Ghn0RFetWeVQubwrPiDDA==
Patches: 0
Preparation:
build_top=$(pwd)
rtems_tools_source=rtems-tools-da2a7f68ed666cc4b3872448adf060129f0ebb5c
source_dir_rtems_tools=${rtems_tools_source}
%setup source rtems-tools -q -n ${rtems_tools_source}
%setup patch rtems-tools -p1
cd ${build_top}
Build:
build_top=$(pwd)
if test "x86_64-freebsd15.0" != "x86_64-freebsd15.0" ; then
RT_HOST="--host=x86_64-freebsd15.0"
else
RT_HOST=
fi
cd ${source_dir_rtems_tools}
./waf distclean configure ${RT_HOST} --prefix=/home/tester/rtems-cron-next/tools/7
./waf
cd ${build_top}
Install:
build_top=$(pwd)
/bin/rm -rf $SB_BUILD_ROOT
cd ${source_dir_rtems_tools}
./waf --destdir=$SB_BUILD_ROOT install
cd ${build_top}
More information about the build
mailing list