September 2026 Archives by author
Starting: Tue Sep 1 00:10:43 UTC 2026
Ending: Wed Sep 30 22:28:37 UTC 2026
Messages: 973
- Build Linux: PASSED 6/rtems-mips on x86_64-linux-gnu
OAR Tester for Rocky Linux 10
- Build Linux: PASSED 6/rtems-moxie on x86_64-linux-gnu
OAR Tester for Rocky Linux 10
- Build Linux: PASSED 6/rtems-nios2 on x86_64-linux-gnu
OAR Tester for Rocky Linux 10
- Build Linux: PASSED 6/rtems-or1k on x86_64-linux-gnu
OAR Tester for Rocky Linux 10
- Build Linux: PASSED 6/rtems-powerpc on x86_64-linux-gnu
OAR Tester for Rocky Linux 10
- Build Linux: PASSED 6/rtems-aarch64 on x86_64-linux-gnu
OAR Tester for Rocky Linux 10
- Build Linux: PASSED 6/rtems-arm on x86_64-linux-gnu
OAR Tester for Rocky Linux 10
- Build Linux: PASSED 6/rtems-bfin on x86_64-linux-gnu
OAR Tester for Rocky Linux 10
- Build Linux: PASSED 6/rtems-i386 on x86_64-linux-gnu
OAR Tester for Rocky Linux 10
- Build Linux: PASSED 6/rtems-lm32 on x86_64-linux-gnu
OAR Tester for Rocky Linux 10
- Build Linux: PASSED 6/rtems-m68k on x86_64-linux-gnu
OAR Tester for Rocky Linux 10
- Build Linux: FAILED 6/rtems-microblaze on x86_64-linux-gnu (microblaze-rtems6-gdb-15.2-x86_64-linux-gnu-1)
OAR Tester for Rocky Linux 10
- Build Linux: PASSED 6/rtems-mips on x86_64-linux-gnu
OAR Tester for Rocky Linux 10
- Build Linux: PASSED 6/rtems-moxie on x86_64-linux-gnu
OAR Tester for Rocky Linux 10
- Build Linux: PASSED 6/rtems-nios2 on x86_64-linux-gnu
OAR Tester for Rocky Linux 10
- Build Linux: PASSED 6/rtems-or1k on x86_64-linux-gnu
OAR Tester for Rocky Linux 10
- Build Linux: PASSED 6/rtems-powerpc on x86_64-linux-gnu
OAR Tester for Rocky Linux 10
- Build Linux: FAILED 6/rtems-riscv on x86_64-linux-gnu (sis-e785959b498edcdf40e858631545a24b839d597f-x86_64-linux-gnu-1)
OAR Tester for Rocky Linux 10
- Build Linux: PASSED 6/rtems-sh on x86_64-linux-gnu
OAR Tester for Rocky Linux 10
- Build Linux: FAILED 6/rtems-sparc on x86_64-linux-gnu (sis-e785959b498edcdf40e858631545a24b839d597f-x86_64-linux-gnu-1)
OAR Tester for Rocky Linux 10
- Build Linux: PASSED 6/rtems-sparc64 on x86_64-linux-gnu
OAR Tester for Rocky Linux 10
- Build Linux: PASSED 6/rtems-v850 on x86_64-linux-gnu
OAR Tester for Rocky Linux 10
- Build Linux: PASSED 6/rtems-x86_64 on x86_64-linux-gnu
OAR Tester for Rocky Linux 10
- Build Linux: PASSED devel/dtc on x86_64-linux-gnu
OAR Tester for Rocky Linux 10
- Build Linux: PASSED devel/spike on x86_64-linux-gnu
OAR Tester for Rocky Linux 10
- Build Linux: PASSED devel/qemu on x86_64-linux-gnu
OAR Tester for Rocky Linux 10
- [rtems-test] powerpc/psim: RTEMS_POSIX_API: Passed:636 Failed:8 Timeout:1 Test-Too-long:0 Invalid:0 Wrong:0
OAR Tester for Rocky Linux 10
- [rtems-test] powerpc/psim: RTEMS_DEBUG, RTEMS_POSIX_API: Passed:636 Failed:9 Timeout:0 Test-Too-long:0 Invalid:0 Wrong:0
OAR Tester for Rocky Linux 10
- [rtems-bsp-builder] 2026-09-02 19:57:51: Profile(s): everything
OAR Tester for Rocky Linux 10
- Build Linux: PASSED 7/rtems-aarch64 on x86_64-linux-gnu
OAR Tester for Rocky Linux 10
- Build Linux: PASSED 7/rtems-arm on x86_64-linux-gnu
OAR Tester for Rocky Linux 10
- Build Linux: PASSED 7/rtems-i386 on x86_64-linux-gnu
OAR Tester for Rocky Linux 10
- Build Linux: PASSED 7/rtems-m68k on x86_64-linux-gnu
OAR Tester for Rocky Linux 10
- Build Linux: PASSED 7/rtems-microblaze on x86_64-linux-gnu
OAR Tester for Rocky Linux 10
- Build Linux: PASSED 7/rtems-mips on x86_64-linux-gnu
OAR Tester for Rocky Linux 10
- Build Linux: PASSED 7/rtems-moxie on x86_64-linux-gnu
OAR Tester for Rocky Linux 10
- Build Linux: PASSED 7/rtems-nios2 on x86_64-linux-gnu
OAR Tester for Rocky Linux 10
- Build Linux: PASSED 7/rtems-or1k on x86_64-linux-gnu
OAR Tester for Rocky Linux 10
- Build Linux: PASSED 7/rtems-powerpc on x86_64-linux-gnu
OAR Tester for Rocky Linux 10
- Build Linux: FAILED 7/rtems-riscv on x86_64-linux-gnu (sis-6cf1cfc91f8fcc2ae6b5461568feee4738f5e042-x86_64-linux-gnu-1)
OAR Tester for Rocky Linux 10
- Build Linux: FAILED 7/rtems-sparc on x86_64-linux-gnu (sis-6cf1cfc91f8fcc2ae6b5461568feee4738f5e042-x86_64-linux-gnu-1)
OAR Tester for Rocky Linux 10
- Build Linux: PASSED 7/rtems-x86_64 on x86_64-linux-gnu
OAR Tester for Rocky Linux 10
- Build Linux: PASSED devel/dtc on x86_64-linux-gnu
OAR Tester for Rocky Linux 10
- Build Linux: PASSED devel/spike on x86_64-linux-gnu
OAR Tester for Rocky Linux 10
- Build Linux: PASSED devel/qemu on x86_64-linux-gnu
OAR Tester for Rocky Linux 10
- [rtems-bsp-builder] 2026-09-03 04:16:04: Profile(s): everything
OAR Tester for Rocky Linux 10
- Build Linux: FAILED 7/rtems-riscv on x86_64-linux-gnu (riscv-rtems7-gdb-17.2-x86_64-linux-gnu-1)
OAR Tester for Rocky Linux 10
- Build Linux: PASSED 6/rtems-aarch64 on x86_64-linux-gnu
OAR Tester for Rocky Linux 10
- Build Linux: PASSED 6/rtems-arm on x86_64-linux-gnu
OAR Tester for Rocky Linux 10
- Build Linux: PASSED 6/rtems-bfin on x86_64-linux-gnu
OAR Tester for Rocky Linux 10
- Build Linux: PASSED 6/rtems-i386 on x86_64-linux-gnu
OAR Tester for Rocky Linux 10
- Build Linux: PASSED 6/rtems-lm32 on x86_64-linux-gnu
OAR Tester for Rocky Linux 10
- Build Linux: PASSED 7/rtems-riscv on x86_64-linux-gnu
OAR Tester for Rocky Linux 10
- Build Linux: PASSED 6/rtems-m68k on x86_64-linux-gnu
OAR Tester for Rocky Linux 10
- Build Linux: FAILED 6/rtems-microblaze on x86_64-linux-gnu (microblaze-rtems6-gdb-15.2-x86_64-linux-gnu-1)
OAR Tester for Rocky Linux 10
- Build Linux: PASSED 6/rtems-mips on x86_64-linux-gnu
OAR Tester for Rocky Linux 10
- Build Linux: PASSED 6/rtems-moxie on x86_64-linux-gnu
OAR Tester for Rocky Linux 10
- Build Linux: PASSED 6/rtems-nios2 on x86_64-linux-gnu
OAR Tester for Rocky Linux 10
- Build Linux: PASSED devel/dtc on x86_64-linux-gnu
OAR Tester for Rocky Linux 10
- Build Linux: FAILED 7/rtems-sparc on x86_64-linux-gnu (sparc-rtems7-gcc-15.2.0-newlib-7d4336cf-x86_64-linux-gnu-1)
OAR Tester for Rocky Linux 10
- Build Linux: FAILED 7/rtems-microblaze on x86_64-linux-gnu (microblaze-rtems7-gdb-17.2-x86_64-linux-gnu-1)
OAR Tester for Rocky Linux 10
- Build Linux: PASSED 7/rtems-sparc on x86_64-linux-gnu
OAR Tester for Rocky Linux 10
- Build Linux: FAILED 7/rtems-mips on x86_64-linux-gnu (mips-rtems7-gcc-15.2.0-newlib-7d4336cf-x86_64-linux-gnu-1)
OAR Tester for Rocky Linux 10
- Build Linux: PASSED 6/rtems-aarch64 on x86_64-linux-gnu
OAR Tester for Rocky Linux 10
- Build Linux: PASSED 6/rtems-arm on x86_64-linux-gnu
OAR Tester for Rocky Linux 10
- Build Linux: PASSED 6/rtems-bfin on x86_64-linux-gnu
OAR Tester for Rocky Linux 10
- Build Linux: PASSED 6/rtems-i386 on x86_64-linux-gnu
OAR Tester for Rocky Linux 10
- Build Linux: PASSED 6/rtems-lm32 on x86_64-linux-gnu
OAR Tester for Rocky Linux 10
- Build Linux: PASSED 6/rtems-m68k on x86_64-linux-gnu
OAR Tester for Rocky Linux 10
- Build Linux: FAILED 6/rtems-microblaze on x86_64-linux-gnu (microblaze-rtems6-gdb-15.2-x86_64-linux-gnu-1)
OAR Tester for Rocky Linux 10
- Build Linux: PASSED 6/rtems-mips on x86_64-linux-gnu
OAR Tester for Rocky Linux 10
- Build Linux: PASSED 6/rtems-moxie on x86_64-linux-gnu
OAR Tester for Rocky Linux 10
- Build Linux: PASSED 6/rtems-nios2 on x86_64-linux-gnu
OAR Tester for Rocky Linux 10
- Build Linux: PASSED 6/rtems-or1k on x86_64-linux-gnu
OAR Tester for Rocky Linux 10
- Build Linux: PASSED 6/rtems-powerpc on x86_64-linux-gnu
OAR Tester for Rocky Linux 10
- Build Linux: PASSED 6/rtems-riscv on x86_64-linux-gnu
OAR Tester for Rocky Linux 10
- Build Linux: PASSED 6/rtems-sh on x86_64-linux-gnu
OAR Tester for Rocky Linux 10
- Build Linux: PASSED 6/rtems-sparc on x86_64-linux-gnu
OAR Tester for Rocky Linux 10
- Build Linux: PASSED 6/rtems-sparc64 on x86_64-linux-gnu
OAR Tester for Rocky Linux 10
- Build Linux: PASSED 6/rtems-v850 on x86_64-linux-gnu
OAR Tester for Rocky Linux 10
- Build Linux: PASSED 6/rtems-x86_64 on x86_64-linux-gnu
OAR Tester for Rocky Linux 10
- Build Linux: PASSED devel/dtc on x86_64-linux-gnu
OAR Tester for Rocky Linux 10
- Build Linux: PASSED devel/spike on x86_64-linux-gnu
OAR Tester for Rocky Linux 10
- Build Linux: PASSED devel/qemu on x86_64-linux-gnu
OAR Tester for Rocky Linux 10
- [rtems-test] sparc/erc32: RTEMS_POSIX_API: Passed:635 Failed:9 Timeout:0 Test-Too-long:0 Invalid:0 Wrong:0
OAR Tester for Rocky Linux 10
- [rtems-test] sparc/leon2: RTEMS_POSIX_API: Passed:642 Failed:2 Timeout:0 Test-Too-long:0 Invalid:0 Wrong:0
OAR Tester for Rocky Linux 10
- [rtems-test] sparc/leon2: RTEMS_DEBUG, RTEMS_POSIX_API: Passed:640 Failed:4 Timeout:0 Test-Too-long:0 Invalid:0 Wrong:0
OAR Tester for Rocky Linux 10
- [rtems-test] sparc/leon3: RTEMS_POSIX_API: Passed:645 Failed:1 Timeout:0 Test-Too-long:0 Invalid:0 Wrong:0
OAR Tester for Rocky Linux 10
- [rtems-test] sparc/leon3: RTEMS_DEBUG, RTEMS_POSIX_API: Passed:643 Failed:3 Timeout:0 Test-Too-long:0 Invalid:0 Wrong:0
OAR Tester for Rocky Linux 10
- [rtems-test] powerpc/psim: RTEMS_POSIX_API: Passed:636 Failed:8 Timeout:1 Test-Too-long:0 Invalid:0 Wrong:0
OAR Tester for Rocky Linux 10
- [rtems-test] powerpc/psim: RTEMS_DEBUG, RTEMS_POSIX_API: Passed:636 Failed:9 Timeout:0 Test-Too-long:0 Invalid:0 Wrong:0
OAR Tester for Rocky Linux 10
- [rtems-test] sparc/leon3: RTEMS_POSIX_API, RTEMS_SMP: Passed:716 Failed:1 Timeout:0 Test-Too-long:0 Invalid:0 Wrong:0
OAR Tester for Rocky Linux 10
- [rtems-test] sparc/leon3: RTEMS_DEBUG, RTEMS_POSIX_API, RTEMS_SMP: Passed:715 Failed:2 Timeout:0 Test-Too-long:0 Invalid:0 Wrong:0
OAR Tester for Rocky Linux 10
- [rtems-test] riscv32/rv32i: RTEMS_POSIX_API: Passed:633 Failed:12 Timeout:0 Test-Too-long:0 Invalid:0 Wrong:0
OAR Tester for Rocky Linux 10
- [rtems-test] riscv32/rv32i: RTEMS_DEBUG, RTEMS_POSIX_API: Passed:631 Failed:14 Timeout:0 Test-Too-long:0 Invalid:0 Wrong:0
OAR Tester for Rocky Linux 10
- [rtems-test] riscv32/rv32imac: RTEMS_POSIX_API: Passed:631 Failed:13 Timeout:0 Test-Too-long:0 Invalid:1 Wrong:0
OAR Tester for Rocky Linux 10
- [rtems-test] riscv32/rv32imac: RTEMS_DEBUG, RTEMS_POSIX_API: Passed:631 Failed:14 Timeout:0 Test-Too-long:0 Invalid:0 Wrong:0
OAR Tester for Rocky Linux 10
- [rtems-test] riscv32/rv32imafdc: RTEMS_POSIX_API: Passed:633 Failed:12 Timeout:0 Test-Too-long:0 Invalid:0 Wrong:0
OAR Tester for Rocky Linux 10
- [rtems-test] riscv32/rv32imafdc: RTEMS_DEBUG, RTEMS_POSIX_API: Passed:632 Failed:13 Timeout:0 Test-Too-long:0 Invalid:0 Wrong:0
OAR Tester for Rocky Linux 10
- [rtems-test] riscv64/rv64imac: RTEMS_POSIX_API: Passed:632 Failed:13 Timeout:0 Test-Too-long:0 Invalid:0 Wrong:0
OAR Tester for Rocky Linux 10
- [rtems-test] riscv64/rv64imac: RTEMS_DEBUG, RTEMS_POSIX_API: Passed:630 Failed:15 Timeout:0 Test-Too-long:0 Invalid:0 Wrong:0
OAR Tester for Rocky Linux 10
- [rtems-test] riscv64/rv64imafdc: RTEMS_POSIX_API: Passed:631 Failed:14 Timeout:0 Test-Too-long:0 Invalid:0 Wrong:0
OAR Tester for Rocky Linux 10
- [rtems-test] riscv64/rv64imafdc: RTEMS_DEBUG, RTEMS_POSIX_API: Passed:628 Failed:17 Timeout:0 Test-Too-long:0 Invalid:0 Wrong:0
OAR Tester for Rocky Linux 10
- [rtems-bsp-builder] 2026-09-10 00:12:31: Profile(s): everything
OAR Tester for Rocky Linux 10
- Build Linux: PASSED 7/rtems-aarch64 on x86_64-linux-gnu
OAR Tester for Rocky Linux 10
- Build Linux: PASSED 7/rtems-arm on x86_64-linux-gnu
OAR Tester for Rocky Linux 10
- Build Linux: PASSED 7/rtems-i386 on x86_64-linux-gnu
OAR Tester for Rocky Linux 10
- Build Linux: PASSED 7/rtems-m68k on x86_64-linux-gnu
OAR Tester for Rocky Linux 10
- Build Linux: PASSED 7/rtems-microblaze on x86_64-linux-gnu
OAR Tester for Rocky Linux 10
- Build Linux: PASSED 7/rtems-mips on x86_64-linux-gnu
OAR Tester for Rocky Linux 10
- Build Linux: PASSED 7/rtems-moxie on x86_64-linux-gnu
OAR Tester for Rocky Linux 10
- Build Linux: PASSED 7/rtems-nios2 on x86_64-linux-gnu
OAR Tester for Rocky Linux 10
- Build Linux: PASSED 7/rtems-or1k on x86_64-linux-gnu
OAR Tester for Rocky Linux 10
- Build Linux: PASSED 7/rtems-powerpc on x86_64-linux-gnu
OAR Tester for Rocky Linux 10
- Build Linux: PASSED 7/rtems-riscv on x86_64-linux-gnu
OAR Tester for Rocky Linux 10
- Build Linux: PASSED 7/rtems-sparc on x86_64-linux-gnu
OAR Tester for Rocky Linux 10
- Build Linux: PASSED 7/rtems-x86_64 on x86_64-linux-gnu
OAR Tester for Rocky Linux 10
- Build Linux: PASSED devel/dtc on x86_64-linux-gnu
OAR Tester for Rocky Linux 10
- Build Linux: PASSED devel/spike on x86_64-linux-gnu
OAR Tester for Rocky Linux 10
- Build Linux: PASSED devel/qemu on x86_64-linux-gnu
OAR Tester for Rocky Linux 10
- [rtems-test] sparc/erc32: RTEMS_POSIX_API: Passed:668 Failed:3 Timeout:0 Test-Too-long:0 Invalid:0 Wrong:0
OAR Tester for Rocky Linux 10
- [rtems-test] sparc/erc32: RTEMS_DEBUG, RTEMS_POSIX_API: Passed:665 Failed:6 Timeout:0 Test-Too-long:0 Invalid:0 Wrong:0
OAR Tester for Rocky Linux 10
- [rtems-test] sparc/leon2: RTEMS_POSIX_API: Passed:669 Failed:2 Timeout:0 Test-Too-long:0 Invalid:0 Wrong:0
OAR Tester for Rocky Linux 10
- [rtems-test] sparc/leon2: RTEMS_DEBUG, RTEMS_POSIX_API: Passed:666 Failed:5 Timeout:0 Test-Too-long:0 Invalid:0 Wrong:0
OAR Tester for Rocky Linux 10
- [rtems-test] sparc/leon3: RTEMS_POSIX_API: Passed:672 Failed:1 Timeout:0 Test-Too-long:0 Invalid:0 Wrong:0
OAR Tester for Rocky Linux 10
- [rtems-test] sparc/leon3: RTEMS_DEBUG, RTEMS_POSIX_API: Passed:669 Failed:4 Timeout:0 Test-Too-long:0 Invalid:0 Wrong:0
OAR Tester for Rocky Linux 10
- [rtems-test] powerpc/psim: RTEMS_POSIX_API: Passed:668 Failed:3 Timeout:0 Test-Too-long:0 Invalid:0 Wrong:0
OAR Tester for Rocky Linux 10
- [rtems-test] powerpc/psim: RTEMS_DEBUG, RTEMS_POSIX_API: Passed:665 Failed:6 Timeout:0 Test-Too-long:0 Invalid:0 Wrong:0
OAR Tester for Rocky Linux 10
- [rtems-test] mipstx39/jmr3904: RTEMS_POSIX_API: Passed:640 Failed:14 Timeout:15 Test-Too-long:0 Invalid:2 Wrong:0
OAR Tester for Rocky Linux 10
- [rtems-test] mipstx39/jmr3904: RTEMS_DEBUG, RTEMS_POSIX_API: Passed:639 Failed:16 Timeout:14 Test-Too-long:0 Invalid:2 Wrong:0
OAR Tester for Rocky Linux 10
- [rtems-test] riscv/griscv: RTEMS_POSIX_API: Passed:392 Failed:277 Timeout:0 Test-Too-long:0 Invalid:2 Wrong:0
OAR Tester for Rocky Linux 10
- [rtems-test] riscv/griscv: RTEMS_DEBUG, RTEMS_POSIX_API: Passed:382 Failed:288 Timeout:0 Test-Too-long:0 Invalid:1 Wrong:0
OAR Tester for Rocky Linux 10
- [rtems-test] sparc/leon3: RTEMS_POSIX_API, RTEMS_SMP: Passed:745 Failed:0 Timeout:0 Test-Too-long:0 Invalid:0 Wrong:0
OAR Tester for Rocky Linux 10
- [rtems-test] sparc/leon3: RTEMS_DEBUG, RTEMS_POSIX_API, RTEMS_SMP: Passed:742 Failed:3 Timeout:0 Test-Too-long:0 Invalid:0 Wrong:0
OAR Tester for Rocky Linux 10
- [rtems-bsp-builder] 2026-09-10 10:23:20: Profile(s): everything
OAR Tester for Rocky Linux 10
- Build Linux: PASSED 6/rtems-aarch64 on x86_64-linux-gnu
OAR Tester for Rocky Linux 10
- Build Linux: PASSED 6/rtems-arm on x86_64-linux-gnu
OAR Tester for Rocky Linux 10
- Build Linux: PASSED 6/rtems-bfin on x86_64-linux-gnu
OAR Tester for Rocky Linux 10
- Build Linux: PASSED 6/rtems-i386 on x86_64-linux-gnu
OAR Tester for Rocky Linux 10
- Build Linux: PASSED 6/rtems-lm32 on x86_64-linux-gnu
OAR Tester for Rocky Linux 10
- Build Linux: PASSED 6/rtems-m68k on x86_64-linux-gnu
OAR Tester for Rocky Linux 10
- Build Linux: FAILED 6/rtems-microblaze on x86_64-linux-gnu (microblaze-rtems6-gdb-15.2-x86_64-linux-gnu-1)
OAR Tester for Rocky Linux 10
- Build Linux: PASSED 6/rtems-mips on x86_64-linux-gnu
OAR Tester for Rocky Linux 10
- Build Linux: PASSED 6/rtems-moxie on x86_64-linux-gnu
OAR Tester for Rocky Linux 10
- Build Linux: PASSED 6/rtems-nios2 on x86_64-linux-gnu
OAR Tester for Rocky Linux 10
- Build Linux: PASSED 6/rtems-or1k on x86_64-linux-gnu
OAR Tester for Rocky Linux 10
- Build Linux: PASSED 6/rtems-powerpc on x86_64-linux-gnu
OAR Tester for Rocky Linux 10
- Build Linux: PASSED 6/rtems-riscv on x86_64-linux-gnu
OAR Tester for Rocky Linux 10
- Build Linux: PASSED 6/rtems-sh on x86_64-linux-gnu
OAR Tester for Rocky Linux 10
- Build Linux: PASSED 6/rtems-sparc on x86_64-linux-gnu
OAR Tester for Rocky Linux 10
- Build Linux: PASSED 6/rtems-sparc64 on x86_64-linux-gnu
OAR Tester for Rocky Linux 10
- Build Linux: PASSED 6/rtems-v850 on x86_64-linux-gnu
OAR Tester for Rocky Linux 10
- Build Linux: PASSED 6/rtems-x86_64 on x86_64-linux-gnu
OAR Tester for Rocky Linux 10
- Build Linux: PASSED devel/dtc on x86_64-linux-gnu
OAR Tester for Rocky Linux 10
- Build Linux: PASSED devel/spike on x86_64-linux-gnu
OAR Tester for Rocky Linux 10
- Build Linux: PASSED devel/qemu on x86_64-linux-gnu
OAR Tester for Rocky Linux 10
- [rtems-test] sparc/erc32: RTEMS_POSIX_API: Passed:635 Failed:9 Timeout:0 Test-Too-long:0 Invalid:0 Wrong:0
OAR Tester for Rocky Linux 10
- [rtems-test] sparc/erc32: RTEMS_DEBUG, RTEMS_POSIX_API: Passed:639 Failed:5 Timeout:0 Test-Too-long:0 Invalid:0 Wrong:0
OAR Tester for Rocky Linux 10
- [rtems-test] sparc/leon2: RTEMS_POSIX_API: Passed:642 Failed:2 Timeout:0 Test-Too-long:0 Invalid:0 Wrong:0
OAR Tester for Rocky Linux 10
- [rtems-test] sparc/leon2: RTEMS_DEBUG, RTEMS_POSIX_API: Passed:640 Failed:4 Timeout:0 Test-Too-long:0 Invalid:0 Wrong:0
OAR Tester for Rocky Linux 10
- [rtems-test] sparc/leon3: RTEMS_POSIX_API: Passed:645 Failed:1 Timeout:0 Test-Too-long:0 Invalid:0 Wrong:0
OAR Tester for Rocky Linux 10
- [rtems-test] sparc/leon3: RTEMS_DEBUG, RTEMS_POSIX_API: Passed:643 Failed:3 Timeout:0 Test-Too-long:0 Invalid:0 Wrong:0
OAR Tester for Rocky Linux 10
- [rtems-test] powerpc/psim: RTEMS_POSIX_API: Passed:636 Failed:8 Timeout:1 Test-Too-long:0 Invalid:0 Wrong:0
OAR Tester for Rocky Linux 10
- [rtems-test] powerpc/psim: RTEMS_DEBUG, RTEMS_POSIX_API: Passed:636 Failed:9 Timeout:0 Test-Too-long:0 Invalid:0 Wrong:0
OAR Tester for Rocky Linux 10
- [rtems-test] sparc/leon3: RTEMS_POSIX_API, RTEMS_SMP: Passed:716 Failed:1 Timeout:0 Test-Too-long:0 Invalid:0 Wrong:0
OAR Tester for Rocky Linux 10
- [rtems-test] sparc/leon3: RTEMS_DEBUG, RTEMS_POSIX_API, RTEMS_SMP: Passed:715 Failed:2 Timeout:0 Test-Too-long:0 Invalid:0 Wrong:0
OAR Tester for Rocky Linux 10
- [rtems-test] riscv32/rv32i: RTEMS_POSIX_API: Passed:633 Failed:12 Timeout:0 Test-Too-long:0 Invalid:0 Wrong:0
OAR Tester for Rocky Linux 10
- [rtems-test] riscv32/rv32i: RTEMS_DEBUG, RTEMS_POSIX_API: Passed:631 Failed:14 Timeout:0 Test-Too-long:0 Invalid:0 Wrong:0
OAR Tester for Rocky Linux 10
- [rtems-test] riscv32/rv32imac: RTEMS_POSIX_API: Passed:631 Failed:13 Timeout:0 Test-Too-long:0 Invalid:1 Wrong:0
OAR Tester for Rocky Linux 10
- [rtems-test] riscv32/rv32imac: RTEMS_DEBUG, RTEMS_POSIX_API: Passed:631 Failed:14 Timeout:0 Test-Too-long:0 Invalid:0 Wrong:0
OAR Tester for Rocky Linux 10
- [rtems-test] riscv32/rv32imafdc: RTEMS_POSIX_API: Passed:633 Failed:12 Timeout:0 Test-Too-long:0 Invalid:0 Wrong:0
OAR Tester for Rocky Linux 10
- [rtems-test] riscv32/rv32imafdc: RTEMS_DEBUG, RTEMS_POSIX_API: Passed:632 Failed:13 Timeout:0 Test-Too-long:0 Invalid:0 Wrong:0
OAR Tester for Rocky Linux 10
- [rtems-test] riscv64/rv64imac: RTEMS_POSIX_API: Passed:632 Failed:13 Timeout:0 Test-Too-long:0 Invalid:0 Wrong:0
OAR Tester for Rocky Linux 10
- [rtems-test] riscv64/rv64imac: RTEMS_DEBUG, RTEMS_POSIX_API: Passed:630 Failed:15 Timeout:0 Test-Too-long:0 Invalid:0 Wrong:0
OAR Tester for Rocky Linux 10
- [rtems-test] riscv64/rv64imafdc: RTEMS_POSIX_API: Passed:631 Failed:14 Timeout:0 Test-Too-long:0 Invalid:0 Wrong:0
OAR Tester for Rocky Linux 10
- [rtems-test] riscv64/rv64imafdc: RTEMS_DEBUG, RTEMS_POSIX_API: Passed:628 Failed:17 Timeout:0 Test-Too-long:0 Invalid:0 Wrong:0
OAR Tester for Rocky Linux 10
- [rtems-bsp-builder] 2026-09-18 07:36:50: Profile(s): everything
OAR Tester for Rocky Linux 10
- Build Linux: PASSED 7/rtems-aarch64 on x86_64-linux-gnu
OAR Tester for Rocky Linux 10
- Build Linux: PASSED 7/rtems-arm on x86_64-linux-gnu
OAR Tester for Rocky Linux 10
- Build Linux: PASSED 7/rtems-i386 on x86_64-linux-gnu
OAR Tester for Rocky Linux 10
- Build Linux: PASSED 7/rtems-m68k on x86_64-linux-gnu
OAR Tester for Rocky Linux 10
- Build Linux: PASSED 7/rtems-microblaze on x86_64-linux-gnu
OAR Tester for Rocky Linux 10
- Build Linux: PASSED 7/rtems-mips on x86_64-linux-gnu
OAR Tester for Rocky Linux 10
- Build Linux: PASSED 7/rtems-moxie on x86_64-linux-gnu
OAR Tester for Rocky Linux 10
- Build Linux: PASSED 7/rtems-nios2 on x86_64-linux-gnu
OAR Tester for Rocky Linux 10
- Build Linux: PASSED 7/rtems-or1k on x86_64-linux-gnu
OAR Tester for Rocky Linux 10
- Build Linux: PASSED 7/rtems-powerpc on x86_64-linux-gnu
OAR Tester for Rocky Linux 10
- Build Linux: PASSED 7/rtems-riscv on x86_64-linux-gnu
OAR Tester for Rocky Linux 10
- Build Linux: PASSED 7/rtems-sparc on x86_64-linux-gnu
OAR Tester for Rocky Linux 10
- Build Linux: PASSED 7/rtems-x86_64 on x86_64-linux-gnu
OAR Tester for Rocky Linux 10
- Build Linux: PASSED devel/dtc on x86_64-linux-gnu
OAR Tester for Rocky Linux 10
- Build Linux: PASSED devel/spike on x86_64-linux-gnu
OAR Tester for Rocky Linux 10
- Build Linux: PASSED devel/qemu on x86_64-linux-gnu
OAR Tester for Rocky Linux 10
- [rtems-test] sparc/erc32: RTEMS_POSIX_API: Passed:668 Failed:3 Timeout:0 Test-Too-long:0 Invalid:0 Wrong:0
OAR Tester for Rocky Linux 10
- [rtems-test] sparc/erc32: RTEMS_DEBUG, RTEMS_POSIX_API: Passed:666 Failed:5 Timeout:0 Test-Too-long:0 Invalid:0 Wrong:0
OAR Tester for Rocky Linux 10
- [rtems-test] sparc/leon2: RTEMS_POSIX_API: Passed:669 Failed:2 Timeout:0 Test-Too-long:0 Invalid:0 Wrong:0
OAR Tester for Rocky Linux 10
- [rtems-test] sparc/leon2: RTEMS_DEBUG, RTEMS_POSIX_API: Passed:667 Failed:4 Timeout:0 Test-Too-long:0 Invalid:0 Wrong:0
OAR Tester for Rocky Linux 10
- [rtems-test] sparc/leon3: RTEMS_POSIX_API: Passed:672 Failed:1 Timeout:0 Test-Too-long:0 Invalid:0 Wrong:0
OAR Tester for Rocky Linux 10
- [rtems-test] sparc/leon3: RTEMS_DEBUG, RTEMS_POSIX_API: Passed:670 Failed:3 Timeout:0 Test-Too-long:0 Invalid:0 Wrong:0
OAR Tester for Rocky Linux 10
- [rtems-test] powerpc/psim: RTEMS_POSIX_API: Passed:667 Failed:3 Timeout:1 Test-Too-long:0 Invalid:0 Wrong:0
OAR Tester for Rocky Linux 10
- [rtems-test] powerpc/psim: RTEMS_DEBUG, RTEMS_POSIX_API: Passed:665 Failed:6 Timeout:0 Test-Too-long:0 Invalid:0 Wrong:0
OAR Tester for Rocky Linux 10
- [rtems-test] mipstx39/jmr3904: RTEMS_POSIX_API: Passed:640 Failed:15 Timeout:14 Test-Too-long:0 Invalid:2 Wrong:0
OAR Tester for Rocky Linux 10
- [rtems-test] mipstx39/jmr3904: RTEMS_DEBUG, RTEMS_POSIX_API: Passed:640 Failed:16 Timeout:13 Test-Too-long:0 Invalid:2 Wrong:0
OAR Tester for Rocky Linux 10
- [rtems-test] riscv/griscv: RTEMS_POSIX_API: Passed:392 Failed:277 Timeout:0 Test-Too-long:0 Invalid:2 Wrong:0
OAR Tester for Rocky Linux 10
- [rtems-test] riscv/griscv: RTEMS_DEBUG, RTEMS_POSIX_API: Passed:382 Failed:288 Timeout:0 Test-Too-long:0 Invalid:1 Wrong:0
OAR Tester for Rocky Linux 10
- [rtems-test] sparc/leon3: RTEMS_POSIX_API, RTEMS_SMP: Passed:745 Failed:0 Timeout:0 Test-Too-long:0 Invalid:0 Wrong:0
OAR Tester for Rocky Linux 10
- [rtems-test] sparc/leon3: RTEMS_DEBUG, RTEMS_POSIX_API, RTEMS_SMP: Passed:743 Failed:2 Timeout:0 Test-Too-long:0 Invalid:0 Wrong:0
OAR Tester for Rocky Linux 10
- [rtems-bsp-builder] 2026-09-18 18:00:42: Profile(s): everything
OAR Tester for Rocky Linux 10
- Build Linux: PASSED 6/rtems-aarch64 on x86_64-linux-gnu
OAR Tester for Rocky Linux 10
- Build Linux: PASSED 6/rtems-arm on x86_64-linux-gnu
OAR Tester for Rocky Linux 10
- Build Linux: PASSED 6/rtems-bfin on x86_64-linux-gnu
OAR Tester for Rocky Linux 10
- Build Linux: PASSED 6/rtems-i386 on x86_64-linux-gnu
OAR Tester for Rocky Linux 10
- Build Linux: PASSED 6/rtems-lm32 on x86_64-linux-gnu
OAR Tester for Rocky Linux 10
- Build Linux: PASSED 6/rtems-m68k on x86_64-linux-gnu
OAR Tester for Rocky Linux 10
- Build Linux: FAILED 6/rtems-microblaze on x86_64-linux-gnu (microblaze-rtems6-gdb-15.2-x86_64-linux-gnu-1)
OAR Tester for Rocky Linux 10
- Build Linux: PASSED 6/rtems-mips on x86_64-linux-gnu
OAR Tester for Rocky Linux 10
- Build Linux: PASSED 6/rtems-moxie on x86_64-linux-gnu
OAR Tester for Rocky Linux 10
- Build Linux: PASSED 6/rtems-nios2 on x86_64-linux-gnu
OAR Tester for Rocky Linux 10
- Build Linux: PASSED 6/rtems-or1k on x86_64-linux-gnu
OAR Tester for Rocky Linux 10
- Build Linux: PASSED 6/rtems-powerpc on x86_64-linux-gnu
OAR Tester for Rocky Linux 10
- Build Linux: PASSED 6/rtems-riscv on x86_64-linux-gnu
OAR Tester for Rocky Linux 10
- Build Linux: PASSED 6/rtems-sh on x86_64-linux-gnu
OAR Tester for Rocky Linux 10
- Build Linux: PASSED 6/rtems-sparc on x86_64-linux-gnu
OAR Tester for Rocky Linux 10
- Build Linux: PASSED 6/rtems-sparc64 on x86_64-linux-gnu
OAR Tester for Rocky Linux 10
- Build Linux: PASSED 6/rtems-v850 on x86_64-linux-gnu
OAR Tester for Rocky Linux 10
- Build Linux: PASSED 6/rtems-x86_64 on x86_64-linux-gnu
OAR Tester for Rocky Linux 10
- Build Linux: PASSED devel/dtc on x86_64-linux-gnu
OAR Tester for Rocky Linux 10
- Build Linux: PASSED devel/spike on x86_64-linux-gnu
OAR Tester for Rocky Linux 10
- Build Linux: PASSED devel/qemu on x86_64-linux-gnu
OAR Tester for Rocky Linux 10
- [rtems-test] sparc/erc32: RTEMS_POSIX_API: Passed:635 Failed:9 Timeout:0 Test-Too-long:0 Invalid:0 Wrong:0
OAR Tester for Rocky Linux 10
- [rtems-test] sparc/erc32: RTEMS_DEBUG, RTEMS_POSIX_API: Passed:639 Failed:5 Timeout:0 Test-Too-long:0 Invalid:0 Wrong:0
OAR Tester for Rocky Linux 10
- [rtems-test] sparc/leon2: RTEMS_POSIX_API: Passed:642 Failed:2 Timeout:0 Test-Too-long:0 Invalid:0 Wrong:0
OAR Tester for Rocky Linux 10
- [rtems-test] sparc/leon2: RTEMS_DEBUG, RTEMS_POSIX_API: Passed:640 Failed:4 Timeout:0 Test-Too-long:0 Invalid:0 Wrong:0
OAR Tester for Rocky Linux 10
- [rtems-test] sparc/leon3: RTEMS_POSIX_API: Passed:645 Failed:1 Timeout:0 Test-Too-long:0 Invalid:0 Wrong:0
OAR Tester for Rocky Linux 10
- [rtems-test] sparc/leon3: RTEMS_DEBUG, RTEMS_POSIX_API: Passed:643 Failed:3 Timeout:0 Test-Too-long:0 Invalid:0 Wrong:0
OAR Tester for Rocky Linux 10
- [rtems-test] powerpc/psim: RTEMS_POSIX_API: Passed:636 Failed:8 Timeout:1 Test-Too-long:0 Invalid:0 Wrong:0
OAR Tester for Rocky Linux 10
- [rtems-test] powerpc/psim: RTEMS_DEBUG, RTEMS_POSIX_API: Passed:636 Failed:9 Timeout:0 Test-Too-long:0 Invalid:0 Wrong:0
OAR Tester for Rocky Linux 10
- [rtems-test] sparc/leon3: RTEMS_POSIX_API, RTEMS_SMP: Passed:716 Failed:1 Timeout:0 Test-Too-long:0 Invalid:0 Wrong:0
OAR Tester for Rocky Linux 10
- [rtems-test] sparc/leon3: RTEMS_DEBUG, RTEMS_POSIX_API, RTEMS_SMP: Passed:715 Failed:2 Timeout:0 Test-Too-long:0 Invalid:0 Wrong:0
OAR Tester for Rocky Linux 10
- [rtems-test] riscv32/rv32i: RTEMS_POSIX_API: Passed:633 Failed:12 Timeout:0 Test-Too-long:0 Invalid:0 Wrong:0
OAR Tester for Rocky Linux 10
- [rtems-test] riscv32/rv32i: RTEMS_DEBUG, RTEMS_POSIX_API: Passed:631 Failed:14 Timeout:0 Test-Too-long:0 Invalid:0 Wrong:0
OAR Tester for Rocky Linux 10
- [rtems-test] riscv32/rv32imac: RTEMS_POSIX_API: Passed:631 Failed:13 Timeout:0 Test-Too-long:0 Invalid:1 Wrong:0
OAR Tester for Rocky Linux 10
- [rtems-test] riscv32/rv32imac: RTEMS_DEBUG, RTEMS_POSIX_API: Passed:631 Failed:14 Timeout:0 Test-Too-long:0 Invalid:0 Wrong:0
OAR Tester for Rocky Linux 10
- [rtems-test] riscv32/rv32imafdc: RTEMS_POSIX_API: Passed:633 Failed:12 Timeout:0 Test-Too-long:0 Invalid:0 Wrong:0
OAR Tester for Rocky Linux 10
- [rtems-test] riscv32/rv32imafdc: RTEMS_DEBUG, RTEMS_POSIX_API: Passed:632 Failed:13 Timeout:0 Test-Too-long:0 Invalid:0 Wrong:0
OAR Tester for Rocky Linux 10
- [rtems-test] riscv64/rv64imac: RTEMS_POSIX_API: Passed:632 Failed:13 Timeout:0 Test-Too-long:0 Invalid:0 Wrong:0
OAR Tester for Rocky Linux 10
- [rtems-test] riscv64/rv64imac: RTEMS_DEBUG, RTEMS_POSIX_API: Passed:630 Failed:15 Timeout:0 Test-Too-long:0 Invalid:0 Wrong:0
OAR Tester for Rocky Linux 10
- [rtems-test] riscv64/rv64imafdc: RTEMS_POSIX_API: Passed:631 Failed:14 Timeout:0 Test-Too-long:0 Invalid:0 Wrong:0
OAR Tester for Rocky Linux 10
- [rtems-test] riscv64/rv64imafdc: RTEMS_DEBUG, RTEMS_POSIX_API: Passed:628 Failed:17 Timeout:0 Test-Too-long:0 Invalid:0 Wrong:0
OAR Tester for Rocky Linux 10
- [rtems-bsp-builder] 2026-09-25 07:32:05: Profile(s): everything
OAR Tester for Rocky Linux 10
- Build Linux: PASSED 7/rtems-aarch64 on x86_64-linux-gnu
OAR Tester for Rocky Linux 10
- Build Linux: PASSED 7/rtems-arm on x86_64-linux-gnu
OAR Tester for Rocky Linux 10
- Build Linux: PASSED 7/rtems-i386 on x86_64-linux-gnu
OAR Tester for Rocky Linux 10
- Build Linux: PASSED 7/rtems-m68k on x86_64-linux-gnu
OAR Tester for Rocky Linux 10
- Build Linux: PASSED 7/rtems-microblaze on x86_64-linux-gnu
OAR Tester for Rocky Linux 10
- Build CYGWIN_NT-10.0-26200: PASSED 6/rtems-aarch64 on x86_64-pc-cygwin
OAR Tester for Windows 11
- Build CYGWIN_NT-10.0-26200: PASSED 6/rtems-arm on x86_64-pc-cygwin
OAR Tester for Windows 11
- Build CYGWIN_NT-10.0-26200: PASSED 6/rtems-bfin on x86_64-pc-cygwin
OAR Tester for Windows 11
- Build CYGWIN_NT-10.0-26200: PASSED 6/rtems-i386 on x86_64-pc-cygwin
OAR Tester for Windows 11
- Build CYGWIN_NT-10.0-26200: PASSED 6/rtems-lm32 on x86_64-pc-cygwin
OAR Tester for Windows 11
- Build CYGWIN_NT-10.0-26200: PASSED 6/rtems-m68k on x86_64-pc-cygwin
OAR Tester for Windows 11
- Build CYGWIN_NT-10.0-26200: FAILED 6/rtems-microblaze on x86_64-pc-cygwin (microblaze-rtems6-gdb-15.2-x86_64-pc-cygwin-1)
OAR Tester for Windows 11
- Build CYGWIN_NT-10.0-26200: PASSED 6/rtems-mips on x86_64-pc-cygwin
OAR Tester for Windows 11
- Build CYGWIN_NT-10.0-26200: PASSED 6/rtems-moxie on x86_64-pc-cygwin
OAR Tester for Windows 11
- Build CYGWIN_NT-10.0-26200: PASSED 6/rtems-nios2 on x86_64-pc-cygwin
OAR Tester for Windows 11
- Build CYGWIN_NT-10.0-26200: PASSED 6/rtems-or1k on x86_64-pc-cygwin
OAR Tester for Windows 11
- Build CYGWIN_NT-10.0-26200: PASSED 6/rtems-powerpc on x86_64-pc-cygwin
OAR Tester for Windows 11
- Build CYGWIN_NT-10.0-26200: PASSED 6/rtems-riscv on x86_64-pc-cygwin
OAR Tester for Windows 11
- Build CYGWIN_NT-10.0-26200: FAILED 6/rtems-sh on x86_64-pc-cygwin (sh-rtems6-gcc-13.3.0-newlib-1b3dcfd-x86_64-pc-cygwin-1)
OAR Tester for Windows 11
- Build CYGWIN_NT-10.0-26200: PASSED 6/rtems-sparc on x86_64-pc-cygwin
OAR Tester for Windows 11
- Build CYGWIN_NT-10.0-26200: PASSED 6/rtems-sparc64 on x86_64-pc-cygwin
OAR Tester for Windows 11
- Build CYGWIN_NT-10.0-26200: PASSED 6/rtems-v850 on x86_64-pc-cygwin
OAR Tester for Windows 11
- Build CYGWIN_NT-10.0-26200: FAILED 6/rtems-x86_64 on x86_64-pc-cygwin (grub2-2.06-x86_64-pc-cygwin-1)
OAR Tester for Windows 11
- Build CYGWIN_NT-10.0-26200: PASSED devel/dtc on x86_64-pc-cygwin
OAR Tester for Windows 11
- Build CYGWIN_NT-10.0-26200: FAILED devel/spike on x86_64-pc-cygwin (spike-530af85d83781a3dae31a4ace84a573ec255fefa-x86_64-pc-cygwin-1)
OAR Tester for Windows 11
- Build CYGWIN_NT-10.0-26200: FAILED devel/qemu on x86_64-pc-cygwin (gettext-0.18.3.1-x86_64-pc-cygwin-1)
OAR Tester for Windows 11
- Build CYGWIN_NT-10.0-26200: PASSED 7/rtems-aarch64 on x86_64-pc-cygwin
OAR Tester for Windows 11
- Build CYGWIN_NT-10.0-26200: PASSED 7/rtems-arm on x86_64-pc-cygwin
OAR Tester for Windows 11
- Build CYGWIN_NT-10.0-26200: PASSED 7/rtems-i386 on x86_64-pc-cygwin
OAR Tester for Windows 11
- Build CYGWIN_NT-10.0-26200: PASSED 7/rtems-m68k on x86_64-pc-cygwin
OAR Tester for Windows 11
- Build CYGWIN_NT-10.0-26200: PASSED 7/rtems-microblaze on x86_64-pc-cygwin
OAR Tester for Windows 11
- Build CYGWIN_NT-10.0-26200: PASSED 7/rtems-mips on x86_64-pc-cygwin
OAR Tester for Windows 11
- Build CYGWIN_NT-10.0-26200: PASSED 7/rtems-moxie on x86_64-pc-cygwin
OAR Tester for Windows 11
- Build CYGWIN_NT-10.0-26200: PASSED 7/rtems-nios2 on x86_64-pc-cygwin
OAR Tester for Windows 11
- Build CYGWIN_NT-10.0-26200: PASSED 7/rtems-or1k on x86_64-pc-cygwin
OAR Tester for Windows 11
- Build CYGWIN_NT-10.0-26200: PASSED 7/rtems-powerpc on x86_64-pc-cygwin
OAR Tester for Windows 11
- Build CYGWIN_NT-10.0-26200: PASSED 7/rtems-riscv on x86_64-pc-cygwin
OAR Tester for Windows 11
- Build CYGWIN_NT-10.0-26200: PASSED 7/rtems-sparc on x86_64-pc-cygwin
OAR Tester for Windows 11
- Build CYGWIN_NT-10.0-26200: FAILED 7/rtems-x86_64 on x86_64-pc-cygwin (grub2-2.06-x86_64-pc-cygwin-1)
OAR Tester for Windows 11
- Build CYGWIN_NT-10.0-26200: PASSED devel/dtc on x86_64-pc-cygwin
OAR Tester for Windows 11
- Build CYGWIN_NT-10.0-26200: FAILED devel/spike on x86_64-pc-cygwin (spike-530af85d83781a3dae31a4ace84a573ec255fefa-x86_64-pc-cygwin-1)
OAR Tester for Windows 11
- Build CYGWIN_NT-10.0-26200: FAILED devel/qemu on x86_64-pc-cygwin (pixman-0.46.4-x86_64-pc-cygwin-1)
OAR Tester for Windows 11
- Build FreeBSD: PASSED next/rtems-sparc on x86_64-freebsd14.4
OAR Tester for FreeBSD 14
- Build FreeBSD: PASSED next/rtems-x86_64 on x86_64-freebsd14.4
OAR Tester for FreeBSD 14
- Build FreeBSD: PASSED devel/dtc on x86_64-freebsd14.4
OAR Tester for FreeBSD 14
- Build FreeBSD: PASSED devel/spike on x86_64-freebsd14.4
OAR Tester for FreeBSD 14
- Build FreeBSD: FAILED devel/qemu on x86_64-freebsd14.4 (qemu-9.2.4-x86_64-freebsd14.4-1)
OAR Tester for FreeBSD 14
- Build FreeBSD: PASSED 6/rtems-aarch64 on x86_64-freebsd14.4
OAR Tester for FreeBSD 14
- Build FreeBSD: PASSED 6/rtems-arm on x86_64-freebsd14.4
OAR Tester for FreeBSD 14
- Build FreeBSD: PASSED 6/rtems-bfin on x86_64-freebsd14.4
OAR Tester for FreeBSD 14
- Build FreeBSD: PASSED 6/rtems-i386 on x86_64-freebsd14.4
OAR Tester for FreeBSD 14
- Build FreeBSD: PASSED 6/rtems-lm32 on x86_64-freebsd14.4
OAR Tester for FreeBSD 14
- Build FreeBSD: PASSED 6/rtems-m68k on x86_64-freebsd14.4
OAR Tester for FreeBSD 14
- Build FreeBSD: FAILED 6/rtems-microblaze on x86_64-freebsd14.4 (microblaze-rtems6-gdb-15.2-x86_64-freebsd14.4-1)
OAR Tester for FreeBSD 14
- Build FreeBSD: PASSED 6/rtems-mips on x86_64-freebsd14.4
OAR Tester for FreeBSD 14
- Build FreeBSD: PASSED 6/rtems-moxie on x86_64-freebsd14.4
OAR Tester for FreeBSD 14
- Build FreeBSD: PASSED 6/rtems-nios2 on x86_64-freebsd14.4
OAR Tester for FreeBSD 14
- Build FreeBSD: PASSED 6/rtems-or1k on x86_64-freebsd14.4
OAR Tester for FreeBSD 14
- Build FreeBSD: PASSED 6/rtems-powerpc on x86_64-freebsd14.4
OAR Tester for FreeBSD 14
- Build FreeBSD: PASSED 6/rtems-riscv on x86_64-freebsd14.4
OAR Tester for FreeBSD 14
- Build FreeBSD: PASSED 6/rtems-sh on x86_64-freebsd14.4
OAR Tester for FreeBSD 14
- Build FreeBSD: PASSED 6/rtems-sparc on x86_64-freebsd14.4
OAR Tester for FreeBSD 14
- Build FreeBSD: PASSED 6/rtems-sparc64 on x86_64-freebsd14.4
OAR Tester for FreeBSD 14
- Build FreeBSD: PASSED 6/rtems-v850 on x86_64-freebsd14.4
OAR Tester for FreeBSD 14
- Build FreeBSD: PASSED 6/rtems-x86_64 on x86_64-freebsd14.4
OAR Tester for FreeBSD 14
- Build FreeBSD: PASSED devel/dtc on x86_64-freebsd14.4
OAR Tester for FreeBSD 14
- Build FreeBSD: PASSED devel/spike on x86_64-freebsd14.4
OAR Tester for FreeBSD 14
- Build FreeBSD: FAILED devel/qemu on x86_64-freebsd14.4 (qemu-5.2.0-x86_64-freebsd14.4-1)
OAR Tester for FreeBSD 14
- [rtems-bsp-builder] 2026-09-01 05:32:23: Profile(s): everything
OAR Tester for FreeBSD 14
- Build FreeBSD: FAILED 5/rtems-arm on x86_64-freebsd14.4 (rtems-tools-cbe73fd20550acb4fd932945ed6886174c6ca832-1)
OAR Tester for FreeBSD 14
- Build FreeBSD: FAILED 5/rtems-bfin on x86_64-freebsd14.4 (rtems-tools-cbe73fd20550acb4fd932945ed6886174c6ca832-1)
OAR Tester for FreeBSD 14
- Build FreeBSD: FAILED 5/rtems-epiphany on x86_64-freebsd14.4 (rtems-tools-cbe73fd20550acb4fd932945ed6886174c6ca832-1)
OAR Tester for FreeBSD 14
- Build FreeBSD: FAILED 5/rtems-lm32 on x86_64-freebsd14.4 (rtems-tools-cbe73fd20550acb4fd932945ed6886174c6ca832-1)
OAR Tester for FreeBSD 14
- Build FreeBSD: FAILED 5/rtems-m68k on x86_64-freebsd14.4 (rtems-tools-cbe73fd20550acb4fd932945ed6886174c6ca832-1)
OAR Tester for FreeBSD 14
- Build FreeBSD: FAILED 5/rtems-mips on x86_64-freebsd14.4 (rtems-tools-cbe73fd20550acb4fd932945ed6886174c6ca832-1)
OAR Tester for FreeBSD 14
- Build FreeBSD: FAILED 5/rtems-moxie on x86_64-freebsd14.4 (rtems-tools-cbe73fd20550acb4fd932945ed6886174c6ca832-1)
OAR Tester for FreeBSD 14
- Build FreeBSD: FAILED 5/rtems-nios2 on x86_64-freebsd14.4 (nios2-rtems5-gdb-17.2-x86_64-freebsd14.4-1)
OAR Tester for FreeBSD 14
- Build FreeBSD: FAILED 5/rtems-or1k on x86_64-freebsd14.4 (or1k-rtems5-gdb-8.2.1-x86_64-freebsd14.4-1)
OAR Tester for FreeBSD 14
- Build FreeBSD: FAILED 5/rtems-powerpc on x86_64-freebsd14.4 (rtems-tools-cbe73fd20550acb4fd932945ed6886174c6ca832-1)
OAR Tester for FreeBSD 14
- Build FreeBSD: FAILED 5/rtems-riscv on x86_64-freebsd14.4 (riscv-rtems5-gdb-14.2-x86_64-freebsd14.4-1)
OAR Tester for FreeBSD 14
- Build FreeBSD: FAILED 5/rtems-sh on x86_64-freebsd14.4 (rtems-tools-cbe73fd20550acb4fd932945ed6886174c6ca832-1)
OAR Tester for FreeBSD 14
- Build FreeBSD: FAILED 5/rtems-sparc on x86_64-freebsd14.4 (rtems-tools-cbe73fd20550acb4fd932945ed6886174c6ca832-1)
OAR Tester for FreeBSD 14
- Build FreeBSD: FAILED 5/rtems-sparc64 on x86_64-freebsd14.4 (rtems-tools-cbe73fd20550acb4fd932945ed6886174c6ca832-1)
OAR Tester for FreeBSD 14
- Build FreeBSD: FAILED 5/rtems-v850 on x86_64-freebsd14.4 (rtems-tools-cbe73fd20550acb4fd932945ed6886174c6ca832-1)
OAR Tester for FreeBSD 14
- Build FreeBSD: FAILED 5/rtems-x86_64 on x86_64-freebsd14.4 (x86_64-rtems5-gcc-7.5.0-newlib-7947581-x86_64-freebsd14.4-1)
OAR Tester for FreeBSD 14
- Build FreeBSD: PASSED devel/dtc on x86_64-freebsd14.4
OAR Tester for FreeBSD 14
- Build FreeBSD: PASSED devel/spike on x86_64-freebsd14.4
OAR Tester for FreeBSD 14
- Build FreeBSD: FAILED devel/qemu on x86_64-freebsd14.4 (qemu-9.2.4-x86_64-freebsd14.4-1)
OAR Tester for FreeBSD 14
- Build FreeBSD: PASSED 6/rtems-aarch64 on x86_64-freebsd14.4
OAR Tester for FreeBSD 14
- Build FreeBSD: PASSED 6/rtems-arm on x86_64-freebsd14.4
OAR Tester for FreeBSD 14
- Build FreeBSD: PASSED 6/rtems-bfin on x86_64-freebsd14.4
OAR Tester for FreeBSD 14
- Build FreeBSD: PASSED 6/rtems-i386 on x86_64-freebsd14.4
OAR Tester for FreeBSD 14
- Build FreeBSD: PASSED 6/rtems-lm32 on x86_64-freebsd14.4
OAR Tester for FreeBSD 14
- Build FreeBSD: PASSED 6/rtems-m68k on x86_64-freebsd14.4
OAR Tester for FreeBSD 14
- Build FreeBSD: FAILED 6/rtems-microblaze on x86_64-freebsd14.4 (microblaze-rtems6-gdb-15.2-x86_64-freebsd14.4-1)
OAR Tester for FreeBSD 14
- Build FreeBSD: PASSED 6/rtems-mips on x86_64-freebsd14.4
OAR Tester for FreeBSD 14
- Build FreeBSD: PASSED 6/rtems-moxie on x86_64-freebsd14.4
OAR Tester for FreeBSD 14
- Build FreeBSD: PASSED 6/rtems-nios2 on x86_64-freebsd14.4
OAR Tester for FreeBSD 14
- Build FreeBSD: PASSED 6/rtems-or1k on x86_64-freebsd14.4
OAR Tester for FreeBSD 14
- Build FreeBSD: PASSED 6/rtems-powerpc on x86_64-freebsd14.4
OAR Tester for FreeBSD 14
- Build FreeBSD: PASSED 6/rtems-riscv on x86_64-freebsd14.4
OAR Tester for FreeBSD 14
- Build FreeBSD: PASSED 6/rtems-sh on x86_64-freebsd14.4
OAR Tester for FreeBSD 14
- Build FreeBSD: PASSED 6/rtems-sparc on x86_64-freebsd14.4
OAR Tester for FreeBSD 14
- Build FreeBSD: PASSED 6/rtems-sparc64 on x86_64-freebsd14.4
OAR Tester for FreeBSD 14
- Build FreeBSD: PASSED 6/rtems-v850 on x86_64-freebsd14.4
OAR Tester for FreeBSD 14
- Build FreeBSD: PASSED 6/rtems-x86_64 on x86_64-freebsd14.4
OAR Tester for FreeBSD 14
- Build FreeBSD: PASSED devel/dtc on x86_64-freebsd14.4
OAR Tester for FreeBSD 14
- Build FreeBSD: PASSED devel/spike on x86_64-freebsd14.4
OAR Tester for FreeBSD 14
- Build FreeBSD: FAILED devel/qemu on x86_64-freebsd14.4 (qemu-5.2.0-x86_64-freebsd14.4-1)
OAR Tester for FreeBSD 14
- [rtems-bsp-builder] 2026-09-07 19:26:48: Profile(s): everything
OAR Tester for FreeBSD 14
- Build FreeBSD: PASSED next/rtems-aarch64 on x86_64-freebsd14.4
OAR Tester for FreeBSD 14
- Build FreeBSD: PASSED next/rtems-arm on x86_64-freebsd14.4
OAR Tester for FreeBSD 14
- Build FreeBSD: PASSED next/rtems-i386 on x86_64-freebsd14.4
OAR Tester for FreeBSD 14
- Build FreeBSD: PASSED next/rtems-m68k on x86_64-freebsd14.4
OAR Tester for FreeBSD 14
- Build FreeBSD: PASSED next/rtems-microblaze on x86_64-freebsd14.4
OAR Tester for FreeBSD 14
- Build FreeBSD: PASSED next/rtems-mips on x86_64-freebsd14.4
OAR Tester for FreeBSD 14
- Build FreeBSD: PASSED next/rtems-moxie on x86_64-freebsd14.4
OAR Tester for FreeBSD 14
- Build FreeBSD: PASSED next/rtems-nios2 on x86_64-freebsd14.4
OAR Tester for FreeBSD 14
- Build FreeBSD: PASSED next/rtems-or1k on x86_64-freebsd14.4
OAR Tester for FreeBSD 14
- Build FreeBSD: PASSED next/rtems-powerpc on x86_64-freebsd14.4
OAR Tester for FreeBSD 14
- Build FreeBSD: PASSED next/rtems-riscv on x86_64-freebsd14.4
OAR Tester for FreeBSD 14
- Build FreeBSD: PASSED next/rtems-sparc on x86_64-freebsd14.4
OAR Tester for FreeBSD 14
- Build FreeBSD: PASSED next/rtems-x86_64 on x86_64-freebsd14.4
OAR Tester for FreeBSD 14
- Build FreeBSD: PASSED devel/dtc on x86_64-freebsd14.4
OAR Tester for FreeBSD 14
- Build FreeBSD: PASSED devel/spike on x86_64-freebsd14.4
OAR Tester for FreeBSD 14
- Build FreeBSD: FAILED devel/qemu on x86_64-freebsd14.4 (qemu-9.2.4-x86_64-freebsd14.4-1)
OAR Tester for FreeBSD 14
- [rtems-bsp-builder] 2026-09-22 00:28:35: Profile(s): everything
OAR Tester for FreeBSD 14
- Build FreeBSD: PASSED 7/rtems-aarch64 on x86_64-freebsd14.4
OAR Tester for FreeBSD 14
- Build FreeBSD: PASSED 7/rtems-arm on x86_64-freebsd14.4
OAR Tester for FreeBSD 14
- Build FreeBSD: PASSED 7/rtems-i386 on x86_64-freebsd14.4
OAR Tester for FreeBSD 14
- Build FreeBSD: PASSED 7/rtems-m68k on x86_64-freebsd14.4
OAR Tester for FreeBSD 14
- Build FreeBSD: PASSED 7/rtems-microblaze on x86_64-freebsd14.4
OAR Tester for FreeBSD 14
- Build FreeBSD: PASSED 7/rtems-mips on x86_64-freebsd14.4
OAR Tester for FreeBSD 14
- Build FreeBSD: PASSED 7/rtems-moxie on x86_64-freebsd14.4
OAR Tester for FreeBSD 14
- Build FreeBSD: PASSED 7/rtems-nios2 on x86_64-freebsd14.4
OAR Tester for FreeBSD 14
- Build FreeBSD: PASSED 7/rtems-or1k on x86_64-freebsd14.4
OAR Tester for FreeBSD 14
- Build FreeBSD: PASSED 7/rtems-powerpc on x86_64-freebsd14.4
OAR Tester for FreeBSD 14
- Build FreeBSD: PASSED 7/rtems-riscv on x86_64-freebsd14.4
OAR Tester for FreeBSD 14
- Build FreeBSD: PASSED 7/rtems-sparc on x86_64-freebsd14.4
OAR Tester for FreeBSD 14
- Build FreeBSD: PASSED 7/rtems-x86_64 on x86_64-freebsd14.4
OAR Tester for FreeBSD 14
- Build FreeBSD: PASSED devel/dtc on x86_64-freebsd14.4
OAR Tester for FreeBSD 14
- Build FreeBSD: FAILED devel/qemu on x86_64-freebsd14.4 (qemu-9.2.4-x86_64-freebsd14.4-1)
OAR Tester for FreeBSD 14
- [rtems-bsp-builder] 2026-09-22 11:40:50: Profile(s): everything
OAR Tester for FreeBSD 14
- Build FreeBSD: PASSED next/rtems-aarch64 on x86_64-freebsd14.4
OAR Tester for FreeBSD 14
- Build FreeBSD: PASSED next/rtems-arm on x86_64-freebsd14.4
OAR Tester for FreeBSD 14
- Build FreeBSD: PASSED next/rtems-i386 on x86_64-freebsd14.4
OAR Tester for FreeBSD 14
- Build FreeBSD: PASSED next/rtems-m68k on x86_64-freebsd14.4
OAR Tester for FreeBSD 14
- Build FreeBSD: PASSED next/rtems-microblaze on x86_64-freebsd14.4
OAR Tester for FreeBSD 14
- Build FreeBSD: PASSED next/rtems-mips on x86_64-freebsd14.4
OAR Tester for FreeBSD 14
- Build FreeBSD: PASSED next/rtems-moxie on x86_64-freebsd14.4
OAR Tester for FreeBSD 14
- Build FreeBSD: PASSED next/rtems-nios2 on x86_64-freebsd14.4
OAR Tester for FreeBSD 14
- Build FreeBSD: PASSED next/rtems-or1k on x86_64-freebsd14.4
OAR Tester for FreeBSD 14
- Build FreeBSD: FAILED next/rtems-riscv on x86_64-freebsd14.4 (riscv-rtems7-gcc-15.3.0-newlib-7d4336cf-x86_64-freebsd14.4-1)
OAR Tester for FreeBSD 14
- Build FreeBSD: PASSED next/rtems-x86_64 on x86_64-freebsd14.4
OAR Tester for FreeBSD 14
- Build FreeBSD: PASSED devel/dtc on x86_64-freebsd14.4
OAR Tester for FreeBSD 14
- Build FreeBSD: PASSED devel/spike on x86_64-freebsd14.4
OAR Tester for FreeBSD 14
- Build FreeBSD: FAILED devel/qemu on x86_64-freebsd14.4 (qemu-9.2.4-x86_64-freebsd14.4-1)
OAR Tester for FreeBSD 14
- Build FreeBSD: PASSED 6/rtems-aarch64 on x86_64-freebsd15.0
OAR Tester for FreeBSD 15
- Build FreeBSD: PASSED 6/rtems-arm on x86_64-freebsd15.0
OAR Tester for FreeBSD 15
- Build FreeBSD: PASSED 6/rtems-bfin on x86_64-freebsd15.0
OAR Tester for FreeBSD 15
- Build FreeBSD: PASSED 6/rtems-i386 on x86_64-freebsd15.0
OAR Tester for FreeBSD 15
- Build FreeBSD: PASSED 6/rtems-lm32 on x86_64-freebsd15.0
OAR Tester for FreeBSD 15
- Build FreeBSD: PASSED 6/rtems-m68k on x86_64-freebsd15.0
OAR Tester for FreeBSD 15
- Build FreeBSD: FAILED 6/rtems-microblaze on x86_64-freebsd15.0 (microblaze-rtems6-gdb-15.2-x86_64-freebsd15.0-1)
OAR Tester for FreeBSD 15
- Build FreeBSD: PASSED 6/rtems-mips on x86_64-freebsd15.0
OAR Tester for FreeBSD 15
- Build FreeBSD: PASSED 6/rtems-moxie on x86_64-freebsd15.0
OAR Tester for FreeBSD 15
- Build FreeBSD: PASSED 6/rtems-nios2 on x86_64-freebsd15.0
OAR Tester for FreeBSD 15
- Build FreeBSD: PASSED 6/rtems-or1k on x86_64-freebsd15.0
OAR Tester for FreeBSD 15
- Build FreeBSD: PASSED 6/rtems-powerpc on x86_64-freebsd15.0
OAR Tester for FreeBSD 15
- Build FreeBSD: PASSED 6/rtems-riscv on x86_64-freebsd15.0
OAR Tester for FreeBSD 15
- Build FreeBSD: PASSED 6/rtems-sh on x86_64-freebsd15.0
OAR Tester for FreeBSD 15
- Build FreeBSD: PASSED 6/rtems-sparc on x86_64-freebsd15.0
OAR Tester for FreeBSD 15
- Build FreeBSD: PASSED 6/rtems-sparc64 on x86_64-freebsd15.0
OAR Tester for FreeBSD 15
- Build FreeBSD: PASSED 6/rtems-v850 on x86_64-freebsd15.0
OAR Tester for FreeBSD 15
- Build FreeBSD: PASSED 6/rtems-x86_64 on x86_64-freebsd15.0
OAR Tester for FreeBSD 15
- Build FreeBSD: PASSED devel/dtc on x86_64-freebsd15.0
OAR Tester for FreeBSD 15
- Build FreeBSD: FAILED devel/spike on x86_64-freebsd15.0 (spike-530af85d83781a3dae31a4ace84a573ec255fefa-x86_64-freebsd15.0-1)
OAR Tester for FreeBSD 15
- Build FreeBSD: FAILED devel/qemu on x86_64-freebsd15.0 (qemu-5.2.0-x86_64-freebsd15.0-1)
OAR Tester for FreeBSD 15
- [rtems-bsp-builder] 2026-09-08 15:28:50: Profile(s): everything
OAR Tester for FreeBSD 15
- Build FreeBSD: PASSED 7/rtems-aarch64 on x86_64-freebsd15.0
OAR Tester for FreeBSD 15
- Build FreeBSD: PASSED 7/rtems-arm on x86_64-freebsd15.0
OAR Tester for FreeBSD 15
- Build FreeBSD: PASSED 7/rtems-i386 on x86_64-freebsd15.0
OAR Tester for FreeBSD 15
- Build FreeBSD: PASSED 7/rtems-m68k on x86_64-freebsd15.0
OAR Tester for FreeBSD 15
- Build FreeBSD: PASSED 7/rtems-microblaze on x86_64-freebsd15.0
OAR Tester for FreeBSD 15
- Build FreeBSD: PASSED 7/rtems-mips on x86_64-freebsd15.0
OAR Tester for FreeBSD 15
- Build FreeBSD: PASSED 7/rtems-moxie on x86_64-freebsd15.0
OAR Tester for FreeBSD 15
- Build FreeBSD: PASSED 7/rtems-nios2 on x86_64-freebsd15.0
OAR Tester for FreeBSD 15
- Build FreeBSD: PASSED 7/rtems-or1k on x86_64-freebsd15.0
OAR Tester for FreeBSD 15
- Build FreeBSD: PASSED 7/rtems-powerpc on x86_64-freebsd15.0
OAR Tester for FreeBSD 15
- Build FreeBSD: PASSED 7/rtems-riscv on x86_64-freebsd15.0
OAR Tester for FreeBSD 15
- Build FreeBSD: PASSED 7/rtems-sparc on x86_64-freebsd15.0
OAR Tester for FreeBSD 15
- Build FreeBSD: PASSED 7/rtems-x86_64 on x86_64-freebsd15.0
OAR Tester for FreeBSD 15
- Build FreeBSD: PASSED devel/dtc on x86_64-freebsd15.0
OAR Tester for FreeBSD 15
- Build FreeBSD: FAILED devel/spike on x86_64-freebsd15.0 (spike-530af85d83781a3dae31a4ace84a573ec255fefa-x86_64-freebsd15.0-1)
OAR Tester for FreeBSD 15
- [rtems-bsp-builder] 2026-09-09 03:17:20: Profile(s): everything
OAR Tester for FreeBSD 15
- [rtems-bsp-builder] 2026-09-29 13:06:38: Profile(s): everything
OAR Tester for FreeBSD 15
- Build FreeBSD: PASSED 7/rtems-aarch64 on x86_64-freebsd15.0
OAR Tester for FreeBSD 15
- Build FreeBSD: PASSED 7/rtems-arm on x86_64-freebsd15.0
OAR Tester for FreeBSD 15
- Build FreeBSD: PASSED 7/rtems-i386 on x86_64-freebsd15.0
OAR Tester for FreeBSD 15
- Build FreeBSD: PASSED 7/rtems-m68k on x86_64-freebsd15.0
OAR Tester for FreeBSD 15
- Build FreeBSD: PASSED 7/rtems-microblaze on x86_64-freebsd15.0
OAR Tester for FreeBSD 15
- Build FreeBSD: PASSED 7/rtems-mips on x86_64-freebsd15.0
OAR Tester for FreeBSD 15
- Build FreeBSD: PASSED 7/rtems-moxie on x86_64-freebsd15.0
OAR Tester for FreeBSD 15
- Build FreeBSD: PASSED 7/rtems-nios2 on x86_64-freebsd15.0
OAR Tester for FreeBSD 15
- Build FreeBSD: PASSED 7/rtems-or1k on x86_64-freebsd15.0
OAR Tester for FreeBSD 15
- Build FreeBSD: PASSED 7/rtems-powerpc on x86_64-freebsd15.0
OAR Tester for FreeBSD 15
- Build FreeBSD: PASSED 7/rtems-riscv on x86_64-freebsd15.0
OAR Tester for FreeBSD 15
- Build FreeBSD: PASSED 7/rtems-sparc on x86_64-freebsd15.0
OAR Tester for FreeBSD 15
- Build FreeBSD: PASSED 7/rtems-x86_64 on x86_64-freebsd15.0
OAR Tester for FreeBSD 15
- Build FreeBSD: PASSED devel/dtc on x86_64-freebsd15.0
OAR Tester for FreeBSD 15
- Build FreeBSD: FAILED devel/spike on x86_64-freebsd15.0 (spike-530af85d83781a3dae31a4ace84a573ec255fefa-x86_64-freebsd15.0-1)
OAR Tester for FreeBSD 15
- [rtems-bsp-builder] 2026-09-30 00:34:46: Profile(s): everything
OAR Tester for FreeBSD 15
- Build FreeBSD: PASSED next/rtems-aarch64 on x86_64-freebsd15.0
OAR Tester for FreeBSD 15
- Build FreeBSD: PASSED next/rtems-arm on x86_64-freebsd15.0
OAR Tester for FreeBSD 15
- Build FreeBSD: PASSED next/rtems-i386 on x86_64-freebsd15.0
OAR Tester for FreeBSD 15
- Build FreeBSD: PASSED next/rtems-m68k on x86_64-freebsd15.0
OAR Tester for FreeBSD 15
- Build FreeBSD: FAILED next/rtems-microblaze on x86_64-freebsd15.0 (microblaze-rtems7-gdb-16.1-x86_64-freebsd15.0-1)
OAR Tester for FreeBSD 15
- Build FreeBSD: PASSED next/rtems-nios2 on x86_64-freebsd15.0
OAR Tester for FreeBSD 15
- Build FreeBSD: PASSED next/rtems-or1k on x86_64-freebsd15.0
OAR Tester for FreeBSD 15
- Build FreeBSD: PASSED next/rtems-powerpc on x86_64-freebsd15.0
OAR Tester for FreeBSD 15
- Build FreeBSD: PASSED next/rtems-riscv on x86_64-freebsd15.0
OAR Tester for FreeBSD 15
- Build FreeBSD: PASSED next/rtems-sparc on x86_64-freebsd15.0
OAR Tester for FreeBSD 15
- Build FreeBSD: PASSED next/rtems-x86_64 on x86_64-freebsd15.0
OAR Tester for FreeBSD 15
- Build FreeBSD: PASSED devel/dtc on x86_64-freebsd15.0
OAR Tester for FreeBSD 15
- Build FreeBSD: FAILED devel/spike on x86_64-freebsd15.0 (spike-530af85d83781a3dae31a4ace84a573ec255fefa-x86_64-freebsd15.0-1)
OAR Tester for FreeBSD 15
- Build Linux: PASSED next/rtems-aarch64 on x86_64-linux-gnu
OAR Tester for Ubuntu 24.04
- Build Linux: PASSED next/rtems-arm on x86_64-linux-gnu
OAR Tester for Ubuntu 24.04
- Build Linux: PASSED next/rtems-i386 on x86_64-linux-gnu
OAR Tester for Ubuntu 24.04
- Build Linux: PASSED next/rtems-m68k on x86_64-linux-gnu
OAR Tester for Ubuntu 24.04
- Build Linux: PASSED next/rtems-microblaze on x86_64-linux-gnu
OAR Tester for Ubuntu 24.04
- Build Linux: PASSED next/rtems-mips on x86_64-linux-gnu
OAR Tester for Ubuntu 24.04
- Build Linux: PASSED next/rtems-moxie on x86_64-linux-gnu
OAR Tester for Ubuntu 24.04
- Build Linux: PASSED next/rtems-nios2 on x86_64-linux-gnu
OAR Tester for Ubuntu 24.04
- Build Linux: PASSED next/rtems-or1k on x86_64-linux-gnu
OAR Tester for Ubuntu 24.04
- Build Linux: PASSED next/rtems-powerpc on x86_64-linux-gnu
OAR Tester for Ubuntu 24.04
- Build Linux: PASSED next/rtems-riscv on x86_64-linux-gnu
OAR Tester for Ubuntu 24.04
- Build Linux: PASSED next/rtems-sparc on x86_64-linux-gnu
OAR Tester for Ubuntu 24.04
- Build Linux: PASSED next/rtems-x86_64 on x86_64-linux-gnu
OAR Tester for Ubuntu 24.04
- Build Linux: PASSED devel/dtc on x86_64-linux-gnu
OAR Tester for Ubuntu 24.04
- Build Linux: PASSED devel/spike on x86_64-linux-gnu
OAR Tester for Ubuntu 24.04
- Build Linux: PASSED devel/qemu on x86_64-linux-gnu
OAR Tester for Ubuntu 24.04
- [rtems-bsp-builder] 2026-09-01 19:45:40: Profile(s): everything
OAR Tester for Ubuntu 24.04
- Build Linux: PASSED 6/rtems-aarch64 on x86_64-linux-gnu
OAR Tester for Ubuntu 26
- Build Linux: PASSED 6/rtems-arm on x86_64-linux-gnu
OAR Tester for Ubuntu 26
- Build Linux: PASSED 6/rtems-bfin on x86_64-linux-gnu
OAR Tester for Ubuntu 26
- Build Linux: PASSED 6/rtems-i386 on x86_64-linux-gnu
OAR Tester for Ubuntu 26
- Build Linux: PASSED 6/rtems-lm32 on x86_64-linux-gnu
OAR Tester for Ubuntu 26
- Build Linux: PASSED 6/rtems-m68k on x86_64-linux-gnu
OAR Tester for Ubuntu 26
- Build Linux: FAILED 6/rtems-microblaze on x86_64-linux-gnu (microblaze-rtems6-gdb-15.2-x86_64-linux-gnu-1)
OAR Tester for Ubuntu 26
- Build Linux: PASSED 6/rtems-mips on x86_64-linux-gnu
OAR Tester for Ubuntu 26
- Build Linux: PASSED 6/rtems-moxie on x86_64-linux-gnu
OAR Tester for Ubuntu 26
- Build Linux: PASSED 6/rtems-nios2 on x86_64-linux-gnu
OAR Tester for Ubuntu 26
- Build Linux: PASSED 6/rtems-or1k on x86_64-linux-gnu
OAR Tester for Ubuntu 26
- Build Linux: PASSED 6/rtems-powerpc on x86_64-linux-gnu
OAR Tester for Ubuntu 26
- Build Linux: PASSED 6/rtems-riscv on x86_64-linux-gnu
OAR Tester for Ubuntu 26
- Build Linux: PASSED 6/rtems-sh on x86_64-linux-gnu
OAR Tester for Ubuntu 26
- Build Linux: PASSED 6/rtems-sparc on x86_64-linux-gnu
OAR Tester for Ubuntu 26
- Build Linux: PASSED 6/rtems-sparc64 on x86_64-linux-gnu
OAR Tester for Ubuntu 26
- Build Linux: PASSED 6/rtems-v850 on x86_64-linux-gnu
OAR Tester for Ubuntu 26
- Build Linux: PASSED 6/rtems-x86_64 on x86_64-linux-gnu
OAR Tester for Ubuntu 26
- Build Linux: PASSED devel/dtc on x86_64-linux-gnu
OAR Tester for Ubuntu 26
- Build Linux: PASSED devel/spike on x86_64-linux-gnu
OAR Tester for Ubuntu 26
- Build Linux: PASSED devel/qemu on x86_64-linux-gnu
OAR Tester for Ubuntu 26
- Build Linux: PASSED 5/rtems-arm on x86_64-linux-gnu
OAR Tester for Rocky Linux 9
- Build Linux: PASSED 5/rtems-bfin on x86_64-linux-gnu
OAR Tester for Rocky Linux 9
- Build Linux: PASSED 5/rtems-epiphany on x86_64-linux-gnu
OAR Tester for Rocky Linux 9
- Build Linux: PASSED 5/rtems-lm32 on x86_64-linux-gnu
OAR Tester for Rocky Linux 9
- Build Linux: PASSED 5/rtems-m68k on x86_64-linux-gnu
OAR Tester for Rocky Linux 9
- Build Linux: PASSED 5/rtems-mips on x86_64-linux-gnu
OAR Tester for Rocky Linux 9
- Build Linux: PASSED 5/rtems-moxie on x86_64-linux-gnu
OAR Tester for Rocky Linux 9
- Build Linux: FAILED 5/rtems-nios2 on x86_64-linux-gnu (nios2-rtems5-gdb-17.2-x86_64-linux-gnu-1)
OAR Tester for Rocky Linux 9
- Build Linux: FAILED 5/rtems-or1k on x86_64-linux-gnu (or1k-rtems5-gdb-8.2.1-x86_64-linux-gnu-1)
OAR Tester for Rocky Linux 9
- Build Linux: PASSED 5/rtems-powerpc on x86_64-linux-gnu
OAR Tester for Rocky Linux 9
- Build Linux: FAILED 5/rtems-riscv on x86_64-linux-gnu (riscv-rtems5-gdb-14.2-x86_64-linux-gnu-1)
OAR Tester for Rocky Linux 9
- Build Linux: PASSED 5/rtems-sh on x86_64-linux-gnu
OAR Tester for Rocky Linux 9
- Build Linux: PASSED 5/rtems-sparc on x86_64-linux-gnu
OAR Tester for Rocky Linux 9
- Build Linux: PASSED 5/rtems-sparc64 on x86_64-linux-gnu
OAR Tester for Rocky Linux 9
- Build Linux: PASSED 5/rtems-v850 on x86_64-linux-gnu
OAR Tester for Rocky Linux 9
- Build Linux: PASSED 5/rtems-x86_64 on x86_64-linux-gnu
OAR Tester for Rocky Linux 9
- Build Linux: PASSED devel/dtc on x86_64-linux-gnu
OAR Tester for Rocky Linux 9
- Build Linux: PASSED devel/spike on x86_64-linux-gnu
OAR Tester for Rocky Linux 9
- Build Linux: PASSED devel/qemu on x86_64-linux-gnu
OAR Tester for Rocky Linux 9
- [rtems-test] sparc/erc32: RTEMS_POSIX_API: Passed:583 Failed:0 Timeout:0 Invalid:0 Wrong:0
OAR Tester for Rocky Linux 9
- [rtems-test] sparc/erc32: RTEMS_DEBUG, RTEMS_POSIX_API: Passed:583 Failed:0 Timeout:0 Invalid:0 Wrong:0
OAR Tester for Rocky Linux 9
- [rtems-test] sparc/leon2: RTEMS_POSIX_API: Passed:583 Failed:0 Timeout:0 Invalid:0 Wrong:0
OAR Tester for Rocky Linux 9
- [rtems-test] sparc/leon2: RTEMS_DEBUG, RTEMS_POSIX_API: Passed:583 Failed:0 Timeout:0 Invalid:0 Wrong:0
OAR Tester for Rocky Linux 9
- [rtems-test] sparc/leon3: RTEMS_POSIX_API: Passed:579 Failed:0 Timeout:0 Invalid:4 Wrong:0
OAR Tester for Rocky Linux 9
- [rtems-test] sparc/leon3: RTEMS_DEBUG, RTEMS_POSIX_API: Passed:579 Failed:0 Timeout:0 Invalid:4 Wrong:0
OAR Tester for Rocky Linux 9
- [rtems-test] powerpc/psim: RTEMS_POSIX_API: Passed:567 Failed:0 Timeout:1 Invalid:0 Wrong:0
OAR Tester for Rocky Linux 9
- [rtems-test] powerpc/psim: RTEMS_DEBUG, RTEMS_POSIX_API: Passed:567 Failed:2 Timeout:0 Invalid:0 Wrong:0
OAR Tester for Rocky Linux 9
- [rtems-test] mipstx39/jmr3904: RTEMS_POSIX_API: Passed:542 Failed:13 Timeout:5 Invalid:1 Wrong:0
OAR Tester for Rocky Linux 9
- [rtems-test] mipstx39/jmr3904: RTEMS_DEBUG, RTEMS_POSIX_API: Passed:542 Failed:12 Timeout:6 Invalid:1 Wrong:0
OAR Tester for Rocky Linux 9
- [rtems-test] sparc/leon3: RTEMS_POSIX_API, RTEMS_SMP: Passed:636 Failed:0 Timeout:0 Invalid:5 Wrong:0
OAR Tester for Rocky Linux 9
- [rtems-test] sparc/leon3: RTEMS_DEBUG, RTEMS_POSIX_API, RTEMS_SMP: Passed:635 Failed:1 Timeout:0 Invalid:5 Wrong:0
OAR Tester for Rocky Linux 9
- [rtems-test] arm/realview_pbx_a9_qemu: RTEMS_POSIX_API: Passed:571 Failed:4 Timeout:10 Invalid:0 Wrong:0
OAR Tester for Rocky Linux 9
- [rtems-test] arm/realview_pbx_a9_qemu: RTEMS_DEBUG, RTEMS_POSIX_API: Passed:571 Failed:4 Timeout:10 Invalid:0 Wrong:0
OAR Tester for Rocky Linux 9
- [rtems-test] arm/xilinx_zynq_a9_qemu: RTEMS_POSIX_API: Passed:571 Failed:1 Timeout:10 Invalid:0 Wrong:0
OAR Tester for Rocky Linux 9
- [rtems-test] arm/xilinx_zynq_a9_qemu: RTEMS_DEBUG, RTEMS_POSIX_API: Passed:570 Failed:3 Timeout:10 Invalid:0 Wrong:0
OAR Tester for Rocky Linux 9
- [rtems-test] arm/xilinx_zynq_zc706: RTEMS_POSIX_API: Passed:573 Failed:0 Timeout:10 Invalid:0 Wrong:0
OAR Tester for Rocky Linux 9
- [rtems-test] arm/xilinx_zynq_zc706: RTEMS_DEBUG, RTEMS_POSIX_API: Passed:571 Failed:2 Timeout:10 Invalid:0 Wrong:0
OAR Tester for Rocky Linux 9
- Build Linux: PASSED 7/rtems-aarch64 on x86_64-linux-gnu
OAR Tester for Rocky Linux 9
- Build Linux: PASSED 7/rtems-arm on x86_64-linux-gnu
OAR Tester for Rocky Linux 9
- Build Linux: PASSED 7/rtems-i386 on x86_64-linux-gnu
OAR Tester for Rocky Linux 9
- Build Linux: PASSED 7/rtems-m68k on x86_64-linux-gnu
OAR Tester for Rocky Linux 9
- Build Linux: PASSED 7/rtems-microblaze on x86_64-linux-gnu
OAR Tester for Rocky Linux 9
- Build Linux: PASSED 7/rtems-mips on x86_64-linux-gnu
OAR Tester for Rocky Linux 9
- Build Linux: PASSED 7/rtems-moxie on x86_64-linux-gnu
OAR Tester for Rocky Linux 9
- Build Linux: PASSED 7/rtems-nios2 on x86_64-linux-gnu
OAR Tester for Rocky Linux 9
- Build Linux: PASSED 7/rtems-or1k on x86_64-linux-gnu
OAR Tester for Rocky Linux 9
- Build Linux: PASSED 7/rtems-powerpc on x86_64-linux-gnu
OAR Tester for Rocky Linux 9
- Build Linux: PASSED 7/rtems-riscv on x86_64-linux-gnu
OAR Tester for Rocky Linux 9
- Build Linux: PASSED 7/rtems-sparc on x86_64-linux-gnu
OAR Tester for Rocky Linux 9
- Build Linux: PASSED 7/rtems-x86_64 on x86_64-linux-gnu
OAR Tester for Rocky Linux 9
- Build Linux: PASSED devel/dtc on x86_64-linux-gnu
OAR Tester for Rocky Linux 9
- Build Linux: PASSED devel/spike on x86_64-linux-gnu
OAR Tester for Rocky Linux 9
- Build Linux: PASSED devel/qemu on x86_64-linux-gnu
OAR Tester for Rocky Linux 9
- [rtems-test] sparc/erc32: RTEMS_POSIX_API: Passed:668 Failed:3 Timeout:0 Test-Too-long:0 Invalid:0 Wrong:0
OAR Tester for Rocky Linux 9
- [rtems-bsp-builder] 2026-09-10 16:14:25: Profile(s): everything
OAR Tester for Rocky Linux 9
- [rtems-test] sparc/erc32: RTEMS_DEBUG, RTEMS_POSIX_API: Passed:665 Failed:6 Timeout:0 Test-Too-long:0 Invalid:0 Wrong:0
OAR Tester for Rocky Linux 9
- [rtems-test] sparc/leon2: RTEMS_POSIX_API: Passed:669 Failed:2 Timeout:0 Test-Too-long:0 Invalid:0 Wrong:0
OAR Tester for Rocky Linux 9
- [rtems-test] sparc/leon2: RTEMS_DEBUG, RTEMS_POSIX_API: Passed:666 Failed:5 Timeout:0 Test-Too-long:0 Invalid:0 Wrong:0
OAR Tester for Rocky Linux 9
- [rtems-test] sparc/leon3: RTEMS_POSIX_API: Passed:672 Failed:1 Timeout:0 Test-Too-long:0 Invalid:0 Wrong:0
OAR Tester for Rocky Linux 9
- [rtems-test] sparc/leon3: RTEMS_DEBUG, RTEMS_POSIX_API: Passed:669 Failed:4 Timeout:0 Test-Too-long:0 Invalid:0 Wrong:0
OAR Tester for Rocky Linux 9
- [rtems-test] powerpc/psim: RTEMS_POSIX_API: Passed:668 Failed:3 Timeout:0 Test-Too-long:0 Invalid:0 Wrong:0
OAR Tester for Rocky Linux 9
- [rtems-test] powerpc/psim: RTEMS_DEBUG, RTEMS_POSIX_API: Passed:665 Failed:6 Timeout:0 Test-Too-long:0 Invalid:0 Wrong:0
OAR Tester for Rocky Linux 9
- [rtems-test] mipstx39/jmr3904: RTEMS_POSIX_API: Passed:641 Failed:14 Timeout:14 Test-Too-long:1 Invalid:1 Wrong:0
OAR Tester for Rocky Linux 9
- [rtems-test] mipstx39/jmr3904: RTEMS_DEBUG, RTEMS_POSIX_API: Passed:640 Failed:16 Timeout:13 Test-Too-long:1 Invalid:1 Wrong:0
OAR Tester for Rocky Linux 9
- [rtems-test] riscv/griscv: RTEMS_POSIX_API: Passed:392 Failed:278 Timeout:0 Test-Too-long:0 Invalid:1 Wrong:0
OAR Tester for Rocky Linux 9
- [rtems-test] riscv/griscv: RTEMS_DEBUG, RTEMS_POSIX_API: Passed:382 Failed:288 Timeout:0 Test-Too-long:0 Invalid:1 Wrong:0
OAR Tester for Rocky Linux 9
- [rtems-test] sparc/leon3: RTEMS_POSIX_API, RTEMS_SMP: Passed:745 Failed:0 Timeout:0 Test-Too-long:0 Invalid:0 Wrong:0
OAR Tester for Rocky Linux 9
- [rtems-test] sparc/leon3: RTEMS_DEBUG, RTEMS_POSIX_API, RTEMS_SMP: Passed:742 Failed:3 Timeout:0 Test-Too-long:0 Invalid:0 Wrong:0
OAR Tester for Rocky Linux 9
- [rtems-test] arm/realview_pbx_a9_qemu: RTEMS_POSIX_API: Passed:665 Failed:7 Timeout:0 Test-Too-long:0 Invalid:0 Wrong:0
OAR Tester for Rocky Linux 9
- [rtems-test] arm/realview_pbx_a9_qemu: RTEMS_DEBUG, RTEMS_POSIX_API: Passed:662 Failed:10 Timeout:0 Test-Too-long:0 Invalid:0 Wrong:0
OAR Tester for Rocky Linux 9
- [rtems-test] arm/xilinx_zynq_a9_qemu: RTEMS_POSIX_API: Passed:666 Failed:7 Timeout:0 Test-Too-long:0 Invalid:0 Wrong:0
OAR Tester for Rocky Linux 9
- [rtems-test] arm/xilinx_zynq_a9_qemu: RTEMS_DEBUG, RTEMS_POSIX_API: Passed:663 Failed:10 Timeout:0 Test-Too-long:0 Invalid:0 Wrong:0
OAR Tester for Rocky Linux 9
- [rtems-test] arm/xilinx_zynq_zc706: RTEMS_POSIX_API: Passed:665 Failed:8 Timeout:0 Test-Too-long:0 Invalid:0 Wrong:0
OAR Tester for Rocky Linux 9
- [rtems-test] arm/xilinx_zynq_zc706: RTEMS_DEBUG, RTEMS_POSIX_API: Passed:662 Failed:11 Timeout:0 Test-Too-long:0 Invalid:0 Wrong:0
OAR Tester for Rocky Linux 9
- [rtems-test] aarch64/a53_ilp32_qemu: RTEMS_POSIX_API: Passed:664 Failed:10 Timeout:0 Test-Too-long:0 Invalid:0 Wrong:0
OAR Tester for Rocky Linux 9
- [rtems-test] aarch64/a53_ilp32_qemu: RTEMS_DEBUG, RTEMS_POSIX_API: Passed:661 Failed:13 Timeout:0 Test-Too-long:0 Invalid:0 Wrong:0
OAR Tester for Rocky Linux 9
- [rtems-test] aarch64/a53_lp64_qemu: RTEMS_POSIX_API: Passed:672 Failed:2 Timeout:0 Test-Too-long:0 Invalid:0 Wrong:0
OAR Tester for Rocky Linux 9
- [rtems-test] aarch64/a53_lp64_qemu: RTEMS_DEBUG, RTEMS_POSIX_API: Passed:668 Failed:6 Timeout:0 Test-Too-long:0 Invalid:0 Wrong:0
OAR Tester for Rocky Linux 9
- [rtems-test] i386/pc686: RTEMS_POSIX_API: Passed:659 Failed:1 Timeout:1 Test-Too-long:0 Invalid:10 Wrong:0
OAR Tester for Rocky Linux 9
- [rtems-test] i386/pc686: RTEMS_DEBUG, RTEMS_POSIX_API: Passed:656 Failed:4 Timeout:1 Test-Too-long:0 Invalid:10 Wrong:0
OAR Tester for Rocky Linux 9
- [rtems-test] i386/pc686: RTEMS_POSIX_API: Passed:656 Failed:4 Timeout:1 Test-Too-long:0 Invalid:10 Wrong:0
OAR Tester for Rocky Linux 9
- [rtems-test] i386/pc686: RTEMS_DEBUG, RTEMS_POSIX_API: Passed:653 Failed:7 Timeout:1 Test-Too-long:0 Invalid:10 Wrong:0
OAR Tester for Rocky Linux 9
- [rtems-bsp-builder] 2026-09-11 08:55:20: Profile(s): everything
OAR Tester for Rocky Linux 9
- Build Linux: PASSED next/rtems-aarch64 on x86_64-linux-gnu
OAR Tester for Rocky Linux 9
- Build Linux: PASSED next/rtems-arm on x86_64-linux-gnu
OAR Tester for Rocky Linux 9
- Build Linux: PASSED next/rtems-i386 on x86_64-linux-gnu
OAR Tester for Rocky Linux 9
- Build Linux: PASSED next/rtems-m68k on x86_64-linux-gnu
OAR Tester for Rocky Linux 9
- Build Linux: PASSED next/rtems-microblaze on x86_64-linux-gnu
OAR Tester for Rocky Linux 9
- Build Linux: PASSED next/rtems-mips on x86_64-linux-gnu
OAR Tester for Rocky Linux 9
- Build Linux: PASSED next/rtems-moxie on x86_64-linux-gnu
OAR Tester for Rocky Linux 9
- Build Linux: PASSED next/rtems-nios2 on x86_64-linux-gnu
OAR Tester for Rocky Linux 9
- Build Linux: PASSED next/rtems-or1k on x86_64-linux-gnu
OAR Tester for Rocky Linux 9
- Build Linux: PASSED next/rtems-powerpc on x86_64-linux-gnu
OAR Tester for Rocky Linux 9
- Build Linux: PASSED next/rtems-riscv on x86_64-linux-gnu
OAR Tester for Rocky Linux 9
- Build Linux: PASSED next/rtems-sparc on x86_64-linux-gnu
OAR Tester for Rocky Linux 9
- Build Linux: PASSED next/rtems-x86_64 on x86_64-linux-gnu
OAR Tester for Rocky Linux 9
- Build Linux: PASSED devel/dtc on x86_64-linux-gnu
OAR Tester for Rocky Linux 9
- Build Linux: PASSED devel/spike on x86_64-linux-gnu
OAR Tester for Rocky Linux 9
- Build Linux: PASSED devel/qemu on x86_64-linux-gnu
OAR Tester for Rocky Linux 9
- [rtems-test] sparc/erc32: RTEMS_POSIX_API: Passed:668 Failed:3 Timeout:0 Test-Too-long:0 Invalid:0 Wrong:0
OAR Tester for Rocky Linux 9
- [rtems-test] sparc/erc32: RTEMS_DEBUG, RTEMS_POSIX_API: Passed:665 Failed:6 Timeout:0 Test-Too-long:0 Invalid:0 Wrong:0
OAR Tester for Rocky Linux 9
- [rtems-test] sparc/leon2: RTEMS_POSIX_API: Passed:669 Failed:2 Timeout:0 Test-Too-long:0 Invalid:0 Wrong:0
OAR Tester for Rocky Linux 9
- [rtems-test] sparc/leon2: RTEMS_DEBUG, RTEMS_POSIX_API: Passed:666 Failed:5 Timeout:0 Test-Too-long:0 Invalid:0 Wrong:0
OAR Tester for Rocky Linux 9
- [rtems-test] sparc/leon3: RTEMS_POSIX_API: Passed:672 Failed:1 Timeout:0 Test-Too-long:0 Invalid:0 Wrong:0
OAR Tester for Rocky Linux 9
- [rtems-test] sparc/leon3: RTEMS_DEBUG, RTEMS_POSIX_API: Passed:669 Failed:4 Timeout:0 Test-Too-long:0 Invalid:0 Wrong:0
OAR Tester for Rocky Linux 9
- [rtems-test] powerpc/psim: RTEMS_POSIX_API: Passed:668 Failed:3 Timeout:0 Test-Too-long:0 Invalid:0 Wrong:0
OAR Tester for Rocky Linux 9
- [rtems-test] powerpc/psim: RTEMS_DEBUG, RTEMS_POSIX_API: Passed:665 Failed:6 Timeout:0 Test-Too-long:0 Invalid:0 Wrong:0
OAR Tester for Rocky Linux 9
- [rtems-test] mipstx39/jmr3904: RTEMS_POSIX_API: Passed:640 Failed:14 Timeout:15 Test-Too-long:1 Invalid:1 Wrong:0
OAR Tester for Rocky Linux 9
- [rtems-test] mipstx39/jmr3904: RTEMS_DEBUG, RTEMS_POSIX_API: Passed:640 Failed:16 Timeout:13 Test-Too-long:1 Invalid:1 Wrong:0
OAR Tester for Rocky Linux 9
- [rtems-test] riscv/griscv: RTEMS_POSIX_API: Passed:392 Failed:277 Timeout:0 Test-Too-long:0 Invalid:2 Wrong:0
OAR Tester for Rocky Linux 9
- [rtems-test] riscv/griscv: RTEMS_DEBUG, RTEMS_POSIX_API: Passed:382 Failed:288 Timeout:0 Test-Too-long:0 Invalid:1 Wrong:0
OAR Tester for Rocky Linux 9
- [rtems-test] sparc/leon3: RTEMS_POSIX_API, RTEMS_SMP: Passed:745 Failed:0 Timeout:0 Test-Too-long:0 Invalid:0 Wrong:0
OAR Tester for Rocky Linux 9
- [rtems-test] sparc/leon3: RTEMS_DEBUG, RTEMS_POSIX_API, RTEMS_SMP: Passed:742 Failed:3 Timeout:0 Test-Too-long:0 Invalid:0 Wrong:0
OAR Tester for Rocky Linux 9
- [rtems-test] arm/realview_pbx_a9_qemu: RTEMS_POSIX_API: Passed:665 Failed:7 Timeout:0 Test-Too-long:0 Invalid:0 Wrong:0
OAR Tester for Rocky Linux 9
- [rtems-test] arm/realview_pbx_a9_qemu: RTEMS_DEBUG, RTEMS_POSIX_API: Passed:662 Failed:10 Timeout:0 Test-Too-long:0 Invalid:0 Wrong:0
OAR Tester for Rocky Linux 9
- [rtems-test] arm/xilinx_zynq_a9_qemu: RTEMS_POSIX_API: Passed:666 Failed:7 Timeout:0 Test-Too-long:0 Invalid:0 Wrong:0
OAR Tester for Rocky Linux 9
- [rtems-test] arm/xilinx_zynq_a9_qemu: RTEMS_DEBUG, RTEMS_POSIX_API: Passed:663 Failed:10 Timeout:0 Test-Too-long:0 Invalid:0 Wrong:0
OAR Tester for Rocky Linux 9
- [rtems-test] arm/xilinx_zynq_zc706: RTEMS_POSIX_API: Passed:665 Failed:8 Timeout:0 Test-Too-long:0 Invalid:0 Wrong:0
OAR Tester for Rocky Linux 9
- [rtems-test] arm/xilinx_zynq_zc706: RTEMS_DEBUG, RTEMS_POSIX_API: Passed:662 Failed:11 Timeout:0 Test-Too-long:0 Invalid:0 Wrong:0
OAR Tester for Rocky Linux 9
- [rtems-test] aarch64/a53_ilp32_qemu: RTEMS_POSIX_API: Passed:664 Failed:10 Timeout:0 Test-Too-long:0 Invalid:0 Wrong:0
OAR Tester for Rocky Linux 9
- [rtems-test] aarch64/a53_ilp32_qemu: RTEMS_DEBUG, RTEMS_POSIX_API: Passed:661 Failed:13 Timeout:0 Test-Too-long:0 Invalid:0 Wrong:0
OAR Tester for Rocky Linux 9
- [rtems-test] aarch64/a53_lp64_qemu: RTEMS_POSIX_API: Passed:672 Failed:2 Timeout:0 Test-Too-long:0 Invalid:0 Wrong:0
OAR Tester for Rocky Linux 9
- [rtems-test] aarch64/a53_lp64_qemu: RTEMS_DEBUG, RTEMS_POSIX_API: Passed:668 Failed:6 Timeout:0 Test-Too-long:0 Invalid:0 Wrong:0
OAR Tester for Rocky Linux 9
- [rtems-test] i386/pc686: RTEMS_POSIX_API: Passed:659 Failed:1 Timeout:1 Test-Too-long:0 Invalid:10 Wrong:0
OAR Tester for Rocky Linux 9
- [rtems-test] i386/pc686: RTEMS_DEBUG, RTEMS_POSIX_API: Passed:656 Failed:4 Timeout:1 Test-Too-long:0 Invalid:10 Wrong:0
OAR Tester for Rocky Linux 9
- [rtems-test] i386/pc686: RTEMS_POSIX_API: Passed:656 Failed:4 Timeout:1 Test-Too-long:0 Invalid:10 Wrong:0
OAR Tester for Rocky Linux 9
- [rtems-test] i386/pc686: RTEMS_DEBUG, RTEMS_POSIX_API: Passed:653 Failed:7 Timeout:1 Test-Too-long:0 Invalid:10 Wrong:0
OAR Tester for Rocky Linux 9
- [rtems-bsp-builder] 2026-09-12 07:59:30: Profile(s): everything
OAR Tester for Rocky Linux 9
- [rtems-test] sparc/erc32: RTEMS_POSIX_API: Passed:635 Failed:9 Timeout:0 Test-Too-long:0 Invalid:0 Wrong:0
OAR Tester for Rocky Linux 9
- [rtems-test] sparc/erc32: RTEMS_DEBUG, RTEMS_POSIX_API: Passed:639 Failed:5 Timeout:0 Test-Too-long:0 Invalid:0 Wrong:0
OAR Tester for Rocky Linux 9
- [rtems-test] sparc/leon2: RTEMS_POSIX_API: Passed:642 Failed:2 Timeout:0 Test-Too-long:0 Invalid:0 Wrong:0
OAR Tester for Rocky Linux 9
- [rtems-test] sparc/leon2: RTEMS_DEBUG, RTEMS_POSIX_API: Passed:640 Failed:4 Timeout:0 Test-Too-long:0 Invalid:0 Wrong:0
OAR Tester for Rocky Linux 9
- [rtems-test] sparc/leon3: RTEMS_POSIX_API: Passed:645 Failed:1 Timeout:0 Test-Too-long:0 Invalid:0 Wrong:0
OAR Tester for Rocky Linux 9
- [rtems-test] sparc/leon3: RTEMS_DEBUG, RTEMS_POSIX_API: Passed:643 Failed:3 Timeout:0 Test-Too-long:0 Invalid:0 Wrong:0
OAR Tester for Rocky Linux 9
- [rtems-test] powerpc/psim: RTEMS_POSIX_API: Passed:636 Failed:8 Timeout:1 Test-Too-long:0 Invalid:0 Wrong:0
OAR Tester for Rocky Linux 9
- [rtems-test] powerpc/psim: RTEMS_DEBUG, RTEMS_POSIX_API: Passed:636 Failed:9 Timeout:0 Test-Too-long:0 Invalid:0 Wrong:0
OAR Tester for Rocky Linux 9
- [rtems-test] sparc/leon3: RTEMS_POSIX_API, RTEMS_SMP: Passed:716 Failed:1 Timeout:0 Test-Too-long:0 Invalid:0 Wrong:0
OAR Tester for Rocky Linux 9
- [rtems-test] sparc/leon3: RTEMS_DEBUG, RTEMS_POSIX_API, RTEMS_SMP: Passed:715 Failed:2 Timeout:0 Test-Too-long:0 Invalid:0 Wrong:0
OAR Tester for Rocky Linux 9
- [rtems-test] riscv32/rv32i: RTEMS_POSIX_API: Passed:633 Failed:12 Timeout:0 Test-Too-long:0 Invalid:0 Wrong:0
OAR Tester for Rocky Linux 9
- [rtems-test] riscv32/rv32i: RTEMS_DEBUG, RTEMS_POSIX_API: Passed:631 Failed:14 Timeout:0 Test-Too-long:0 Invalid:0 Wrong:0
OAR Tester for Rocky Linux 9
- [rtems-test] riscv32/rv32imac: RTEMS_POSIX_API: Passed:631 Failed:13 Timeout:0 Test-Too-long:0 Invalid:1 Wrong:0
OAR Tester for Rocky Linux 9
- [rtems-test] riscv32/rv32imac: RTEMS_DEBUG, RTEMS_POSIX_API: Passed:631 Failed:14 Timeout:0 Test-Too-long:0 Invalid:0 Wrong:0
OAR Tester for Rocky Linux 9
- [rtems-test] riscv32/rv32imafdc: RTEMS_POSIX_API: Passed:633 Failed:12 Timeout:0 Test-Too-long:0 Invalid:0 Wrong:0
OAR Tester for Rocky Linux 9
- [rtems-test] riscv32/rv32imafdc: RTEMS_DEBUG, RTEMS_POSIX_API: Passed:632 Failed:13 Timeout:0 Test-Too-long:0 Invalid:0 Wrong:0
OAR Tester for Rocky Linux 9
- [rtems-test] riscv64/rv64imac: RTEMS_POSIX_API: Passed:632 Failed:13 Timeout:0 Test-Too-long:0 Invalid:0 Wrong:0
OAR Tester for Rocky Linux 9
- [rtems-test] riscv64/rv64imac: RTEMS_DEBUG, RTEMS_POSIX_API: Passed:630 Failed:15 Timeout:0 Test-Too-long:0 Invalid:0 Wrong:0
OAR Tester for Rocky Linux 9
- [rtems-test] riscv64/rv64imafdc: RTEMS_POSIX_API: Passed:631 Failed:14 Timeout:0 Test-Too-long:0 Invalid:0 Wrong:0
OAR Tester for Rocky Linux 9
- [rtems-test] riscv64/rv64imafdc: RTEMS_DEBUG, RTEMS_POSIX_API: Passed:628 Failed:17 Timeout:0 Test-Too-long:0 Invalid:0 Wrong:0
OAR Tester for Rocky Linux 9
- [rtems-bsp-builder] 2026-09-16 14:18:33: Profile(s): everything
OAR Tester for Rocky Linux 9
- Build Linux: PASSED 7/rtems-aarch64 on x86_64-linux-gnu
OAR Tester for Rocky Linux 9
- Build Linux: PASSED 7/rtems-arm on x86_64-linux-gnu
OAR Tester for Rocky Linux 9
- Build Linux: PASSED 7/rtems-i386 on x86_64-linux-gnu
OAR Tester for Rocky Linux 9
- Build Linux: PASSED 7/rtems-m68k on x86_64-linux-gnu
OAR Tester for Rocky Linux 9
- Build Linux: PASSED 7/rtems-microblaze on x86_64-linux-gnu
OAR Tester for Rocky Linux 9
- Build Linux: PASSED 7/rtems-mips on x86_64-linux-gnu
OAR Tester for Rocky Linux 9
- Build Linux: PASSED 7/rtems-moxie on x86_64-linux-gnu
OAR Tester for Rocky Linux 9
- Build Linux: PASSED 7/rtems-nios2 on x86_64-linux-gnu
OAR Tester for Rocky Linux 9
- Build Linux: PASSED 7/rtems-or1k on x86_64-linux-gnu
OAR Tester for Rocky Linux 9
- Build Linux: PASSED 7/rtems-powerpc on x86_64-linux-gnu
OAR Tester for Rocky Linux 9
- Build Linux: PASSED 7/rtems-riscv on x86_64-linux-gnu
OAR Tester for Rocky Linux 9
- Build Linux: PASSED 7/rtems-sparc on x86_64-linux-gnu
OAR Tester for Rocky Linux 9
- Build Linux: PASSED 7/rtems-x86_64 on x86_64-linux-gnu
OAR Tester for Rocky Linux 9
- Build Linux: PASSED devel/dtc on x86_64-linux-gnu
OAR Tester for Rocky Linux 9
- Build Linux: PASSED devel/spike on x86_64-linux-gnu
OAR Tester for Rocky Linux 9
- Build Linux: PASSED devel/qemu on x86_64-linux-gnu
OAR Tester for Rocky Linux 9
- [rtems-test] sparc/erc32: RTEMS_POSIX_API: Passed:668 Failed:3 Timeout:0 Test-Too-long:0 Invalid:0 Wrong:0
OAR Tester for Rocky Linux 9
- [rtems-test] sparc/erc32: RTEMS_DEBUG, RTEMS_POSIX_API: Passed:666 Failed:5 Timeout:0 Test-Too-long:0 Invalid:0 Wrong:0
OAR Tester for Rocky Linux 9
- [rtems-test] sparc/leon2: RTEMS_POSIX_API: Passed:669 Failed:2 Timeout:0 Test-Too-long:0 Invalid:0 Wrong:0
OAR Tester for Rocky Linux 9
- [rtems-test] sparc/leon2: RTEMS_DEBUG, RTEMS_POSIX_API: Passed:667 Failed:4 Timeout:0 Test-Too-long:0 Invalid:0 Wrong:0
OAR Tester for Rocky Linux 9
- [rtems-test] sparc/leon3: RTEMS_POSIX_API: Passed:672 Failed:1 Timeout:0 Test-Too-long:0 Invalid:0 Wrong:0
OAR Tester for Rocky Linux 9
- [rtems-test] sparc/leon3: RTEMS_DEBUG, RTEMS_POSIX_API: Passed:670 Failed:3 Timeout:0 Test-Too-long:0 Invalid:0 Wrong:0
OAR Tester for Rocky Linux 9
- [rtems-test] powerpc/psim: RTEMS_POSIX_API: Passed:668 Failed:3 Timeout:0 Test-Too-long:0 Invalid:0 Wrong:0
OAR Tester for Rocky Linux 9
- [rtems-test] powerpc/psim: RTEMS_DEBUG, RTEMS_POSIX_API: Passed:665 Failed:6 Timeout:0 Test-Too-long:0 Invalid:0 Wrong:0
OAR Tester for Rocky Linux 9
- [rtems-test] mipstx39/jmr3904: RTEMS_POSIX_API: Passed:639 Failed:14 Timeout:15 Test-Too-long:1 Invalid:2 Wrong:0
OAR Tester for Rocky Linux 9
- [rtems-test] mipstx39/jmr3904: RTEMS_DEBUG, RTEMS_POSIX_API: Passed:641 Failed:15 Timeout:13 Test-Too-long:1 Invalid:1 Wrong:0
OAR Tester for Rocky Linux 9
- [rtems-test] riscv/griscv: RTEMS_POSIX_API: Passed:392 Failed:278 Timeout:0 Test-Too-long:0 Invalid:1 Wrong:0
OAR Tester for Rocky Linux 9
- [rtems-test] riscv/griscv: RTEMS_DEBUG, RTEMS_POSIX_API: Passed:382 Failed:288 Timeout:0 Test-Too-long:0 Invalid:1 Wrong:0
OAR Tester for Rocky Linux 9
- [rtems-test] sparc/leon3: RTEMS_POSIX_API, RTEMS_SMP: Passed:745 Failed:0 Timeout:0 Test-Too-long:0 Invalid:0 Wrong:0
OAR Tester for Rocky Linux 9
- [rtems-test] sparc/leon3: RTEMS_DEBUG, RTEMS_POSIX_API, RTEMS_SMP: Passed:743 Failed:2 Timeout:0 Test-Too-long:0 Invalid:0 Wrong:0
OAR Tester for Rocky Linux 9
- [rtems-test] arm/realview_pbx_a9_qemu: RTEMS_POSIX_API: Passed:665 Failed:7 Timeout:0 Test-Too-long:0 Invalid:0 Wrong:0
OAR Tester for Rocky Linux 9
- [rtems-test] arm/realview_pbx_a9_qemu: RTEMS_DEBUG, RTEMS_POSIX_API: Passed:663 Failed:9 Timeout:0 Test-Too-long:0 Invalid:0 Wrong:0
OAR Tester for Rocky Linux 9
- [rtems-test] arm/xilinx_zynq_a9_qemu: RTEMS_POSIX_API: Passed:666 Failed:7 Timeout:0 Test-Too-long:0 Invalid:0 Wrong:0
OAR Tester for Rocky Linux 9
- [rtems-test] arm/xilinx_zynq_a9_qemu: RTEMS_DEBUG, RTEMS_POSIX_API: Passed:664 Failed:9 Timeout:0 Test-Too-long:0 Invalid:0 Wrong:0
OAR Tester for Rocky Linux 9
- [rtems-test] arm/xilinx_zynq_zc706: RTEMS_POSIX_API: Passed:665 Failed:8 Timeout:0 Test-Too-long:0 Invalid:0 Wrong:0
OAR Tester for Rocky Linux 9
- [rtems-test] arm/xilinx_zynq_zc706: RTEMS_DEBUG, RTEMS_POSIX_API: Passed:663 Failed:10 Timeout:0 Test-Too-long:0 Invalid:0 Wrong:0
OAR Tester for Rocky Linux 9
- [rtems-test] aarch64/a53_ilp32_qemu: RTEMS_POSIX_API: Passed:664 Failed:10 Timeout:0 Test-Too-long:0 Invalid:0 Wrong:0
OAR Tester for Rocky Linux 9
- [rtems-test] aarch64/a53_ilp32_qemu: RTEMS_DEBUG, RTEMS_POSIX_API: Passed:662 Failed:12 Timeout:0 Test-Too-long:0 Invalid:0 Wrong:0
OAR Tester for Rocky Linux 9
- [rtems-test] aarch64/a53_lp64_qemu: RTEMS_POSIX_API: Passed:672 Failed:2 Timeout:0 Test-Too-long:0 Invalid:0 Wrong:0
OAR Tester for Rocky Linux 9
- [rtems-test] aarch64/a53_lp64_qemu: RTEMS_DEBUG, RTEMS_POSIX_API: Passed:669 Failed:5 Timeout:0 Test-Too-long:0 Invalid:0 Wrong:0
OAR Tester for Rocky Linux 9
- [rtems-test] i386/pc686: RTEMS_POSIX_API: Passed:659 Failed:1 Timeout:1 Test-Too-long:0 Invalid:10 Wrong:0
OAR Tester for Rocky Linux 9
- [rtems-test] i386/pc686: RTEMS_DEBUG, RTEMS_POSIX_API: Passed:657 Failed:3 Timeout:1 Test-Too-long:0 Invalid:10 Wrong:0
OAR Tester for Rocky Linux 9
- [rtems-test] i386/pc686: RTEMS_POSIX_API: Passed:656 Failed:4 Timeout:1 Test-Too-long:0 Invalid:10 Wrong:0
OAR Tester for Rocky Linux 9
- [rtems-test] i386/pc686: RTEMS_DEBUG, RTEMS_POSIX_API: Passed:654 Failed:6 Timeout:1 Test-Too-long:0 Invalid:10 Wrong:0
OAR Tester for Rocky Linux 9
- [rtems-bsp-builder] 2026-09-18 07:52:40: Profile(s): everything
OAR Tester for Rocky Linux 9
- Build Linux: PASSED next/rtems-aarch64 on x86_64-linux-gnu
OAR Tester for Rocky Linux 9
- Build Linux: PASSED next/rtems-arm on x86_64-linux-gnu
OAR Tester for Rocky Linux 9
- Build Linux: PASSED next/rtems-i386 on x86_64-linux-gnu
OAR Tester for Rocky Linux 9
- Build Linux: PASSED next/rtems-m68k on x86_64-linux-gnu
OAR Tester for Rocky Linux 9
- Build Linux: PASSED next/rtems-microblaze on x86_64-linux-gnu
OAR Tester for Rocky Linux 9
- Build Linux: PASSED next/rtems-mips on x86_64-linux-gnu
OAR Tester for Rocky Linux 9
- Build Linux: PASSED next/rtems-moxie on x86_64-linux-gnu
OAR Tester for Rocky Linux 9
- Build Linux: PASSED next/rtems-nios2 on x86_64-linux-gnu
OAR Tester for Rocky Linux 9
- Build Linux: PASSED next/rtems-or1k on x86_64-linux-gnu
OAR Tester for Rocky Linux 9
- Build Linux: PASSED next/rtems-powerpc on x86_64-linux-gnu
OAR Tester for Rocky Linux 9
- Build Linux: PASSED next/rtems-riscv on x86_64-linux-gnu
OAR Tester for Rocky Linux 9
- Build Linux: PASSED next/rtems-sparc on x86_64-linux-gnu
OAR Tester for Rocky Linux 9
- Build Linux: PASSED next/rtems-x86_64 on x86_64-linux-gnu
OAR Tester for Rocky Linux 9
- Build Linux: PASSED devel/dtc on x86_64-linux-gnu
OAR Tester for Rocky Linux 9
- Build Linux: PASSED devel/spike on x86_64-linux-gnu
OAR Tester for Rocky Linux 9
- Build Linux: PASSED devel/qemu on x86_64-linux-gnu
OAR Tester for Rocky Linux 9
- [rtems-test] sparc/erc32: RTEMS_POSIX_API: Passed:668 Failed:3 Timeout:0 Test-Too-long:0 Invalid:0 Wrong:0
OAR Tester for Rocky Linux 9
- [rtems-test] sparc/erc32: RTEMS_DEBUG, RTEMS_POSIX_API: Passed:666 Failed:5 Timeout:0 Test-Too-long:0 Invalid:0 Wrong:0
OAR Tester for Rocky Linux 9
- [rtems-test] sparc/leon2: RTEMS_POSIX_API: Passed:669 Failed:2 Timeout:0 Test-Too-long:0 Invalid:0 Wrong:0
OAR Tester for Rocky Linux 9
- [rtems-test] sparc/leon2: RTEMS_DEBUG, RTEMS_POSIX_API: Passed:667 Failed:4 Timeout:0 Test-Too-long:0 Invalid:0 Wrong:0
OAR Tester for Rocky Linux 9
- [rtems-test] sparc/leon3: RTEMS_POSIX_API: Passed:672 Failed:1 Timeout:0 Test-Too-long:0 Invalid:0 Wrong:0
OAR Tester for Rocky Linux 9
- [rtems-test] sparc/leon3: RTEMS_DEBUG, RTEMS_POSIX_API: Passed:670 Failed:3 Timeout:0 Test-Too-long:0 Invalid:0 Wrong:0
OAR Tester for Rocky Linux 9
- [rtems-test] powerpc/psim: RTEMS_POSIX_API: Passed:668 Failed:3 Timeout:0 Test-Too-long:0 Invalid:0 Wrong:0
OAR Tester for Rocky Linux 9
- [rtems-test] powerpc/psim: RTEMS_DEBUG, RTEMS_POSIX_API: Passed:665 Failed:6 Timeout:0 Test-Too-long:0 Invalid:0 Wrong:0
OAR Tester for Rocky Linux 9
- [rtems-test] mipstx39/jmr3904: RTEMS_POSIX_API: Passed:641 Failed:14 Timeout:14 Test-Too-long:1 Invalid:1 Wrong:0
OAR Tester for Rocky Linux 9
- [rtems-test] mipstx39/jmr3904: RTEMS_DEBUG, RTEMS_POSIX_API: Passed:640 Failed:15 Timeout:14 Test-Too-long:1 Invalid:1 Wrong:0
OAR Tester for Rocky Linux 9
- [rtems-test] riscv/griscv: RTEMS_POSIX_API: Passed:392 Failed:278 Timeout:0 Test-Too-long:0 Invalid:1 Wrong:0
OAR Tester for Rocky Linux 9
- [rtems-test] riscv/griscv: RTEMS_DEBUG, RTEMS_POSIX_API: Passed:382 Failed:288 Timeout:0 Test-Too-long:0 Invalid:1 Wrong:0
OAR Tester for Rocky Linux 9
- [rtems-test] sparc/leon3: RTEMS_POSIX_API, RTEMS_SMP: Passed:745 Failed:0 Timeout:0 Test-Too-long:0 Invalid:0 Wrong:0
OAR Tester for Rocky Linux 9
- [rtems-test] sparc/leon3: RTEMS_DEBUG, RTEMS_POSIX_API, RTEMS_SMP: Passed:743 Failed:2 Timeout:0 Test-Too-long:0 Invalid:0 Wrong:0
OAR Tester for Rocky Linux 9
- [rtems-test] arm/realview_pbx_a9_qemu: RTEMS_POSIX_API: Passed:665 Failed:7 Timeout:0 Test-Too-long:0 Invalid:0 Wrong:0
OAR Tester for Rocky Linux 9
- [rtems-test] arm/realview_pbx_a9_qemu: RTEMS_DEBUG, RTEMS_POSIX_API: Passed:663 Failed:9 Timeout:0 Test-Too-long:0 Invalid:0 Wrong:0
OAR Tester for Rocky Linux 9
- [rtems-test] arm/xilinx_zynq_a9_qemu: RTEMS_POSIX_API: Passed:666 Failed:7 Timeout:0 Test-Too-long:0 Invalid:0 Wrong:0
OAR Tester for Rocky Linux 9
- [rtems-test] arm/xilinx_zynq_a9_qemu: RTEMS_DEBUG, RTEMS_POSIX_API: Passed:664 Failed:9 Timeout:0 Test-Too-long:0 Invalid:0 Wrong:0
OAR Tester for Rocky Linux 9
- [rtems-test] arm/xilinx_zynq_zc706: RTEMS_POSIX_API: Passed:665 Failed:8 Timeout:0 Test-Too-long:0 Invalid:0 Wrong:0
OAR Tester for Rocky Linux 9
- [rtems-test] arm/xilinx_zynq_zc706: RTEMS_DEBUG, RTEMS_POSIX_API: Passed:663 Failed:10 Timeout:0 Test-Too-long:0 Invalid:0 Wrong:0
OAR Tester for Rocky Linux 9
- [rtems-test] aarch64/a53_ilp32_qemu: RTEMS_POSIX_API: Passed:664 Failed:10 Timeout:0 Test-Too-long:0 Invalid:0 Wrong:0
OAR Tester for Rocky Linux 9
- [rtems-test] aarch64/a53_ilp32_qemu: RTEMS_DEBUG, RTEMS_POSIX_API: Passed:662 Failed:12 Timeout:0 Test-Too-long:0 Invalid:0 Wrong:0
OAR Tester for Rocky Linux 9
- [rtems-test] aarch64/a53_lp64_qemu: RTEMS_POSIX_API: Passed:672 Failed:2 Timeout:0 Test-Too-long:0 Invalid:0 Wrong:0
OAR Tester for Rocky Linux 9
- [rtems-test] i386/pc686: RTEMS_POSIX_API: Passed:659 Failed:1 Timeout:1 Test-Too-long:0 Invalid:10 Wrong:0
OAR Tester for Rocky Linux 9
- [rtems-test] i386/pc686: RTEMS_DEBUG, RTEMS_POSIX_API: Passed:657 Failed:3 Timeout:1 Test-Too-long:0 Invalid:10 Wrong:0
OAR Tester for Rocky Linux 9
- [rtems-test] i386/pc686: RTEMS_POSIX_API: Passed:656 Failed:4 Timeout:1 Test-Too-long:0 Invalid:10 Wrong:0
OAR Tester for Rocky Linux 9
- [rtems-test] i386/pc686: RTEMS_DEBUG, RTEMS_POSIX_API: Passed:654 Failed:6 Timeout:1 Test-Too-long:0 Invalid:10 Wrong:0
OAR Tester for Rocky Linux 9
- [rtems-bsp-builder] 2026-09-19 07:53:31: Profile(s): everything
OAR Tester for Rocky Linux 9
- [rtems-test] sparc/erc32: RTEMS_POSIX_API: Passed:635 Failed:9 Timeout:0 Test-Too-long:0 Invalid:0 Wrong:0
OAR Tester for Rocky Linux 9
- [rtems-test] sparc/erc32: RTEMS_DEBUG, RTEMS_POSIX_API: Passed:639 Failed:5 Timeout:0 Test-Too-long:0 Invalid:0 Wrong:0
OAR Tester for Rocky Linux 9
- [rtems-test] sparc/leon2: RTEMS_POSIX_API: Passed:642 Failed:2 Timeout:0 Test-Too-long:0 Invalid:0 Wrong:0
OAR Tester for Rocky Linux 9
- [rtems-test] sparc/leon2: RTEMS_DEBUG, RTEMS_POSIX_API: Passed:640 Failed:4 Timeout:0 Test-Too-long:0 Invalid:0 Wrong:0
OAR Tester for Rocky Linux 9
- [rtems-test] sparc/leon3: RTEMS_DEBUG, RTEMS_POSIX_API: Passed:643 Failed:3 Timeout:0 Test-Too-long:0 Invalid:0 Wrong:0
OAR Tester for Rocky Linux 9
- [rtems-test] powerpc/psim: RTEMS_POSIX_API: Passed:636 Failed:8 Timeout:1 Test-Too-long:0 Invalid:0 Wrong:0
OAR Tester for Rocky Linux 9
- [rtems-test] powerpc/psim: RTEMS_DEBUG, RTEMS_POSIX_API: Passed:636 Failed:9 Timeout:0 Test-Too-long:0 Invalid:0 Wrong:0
OAR Tester for Rocky Linux 9
- [rtems-test] sparc/leon3: RTEMS_POSIX_API, RTEMS_SMP: Passed:716 Failed:1 Timeout:0 Test-Too-long:0 Invalid:0 Wrong:0
OAR Tester for Rocky Linux 9
- [rtems-test] sparc/leon3: RTEMS_DEBUG, RTEMS_POSIX_API, RTEMS_SMP: Passed:715 Failed:2 Timeout:0 Test-Too-long:0 Invalid:0 Wrong:0
OAR Tester for Rocky Linux 9
- [rtems-test] riscv32/rv32i: RTEMS_POSIX_API: Passed:633 Failed:12 Timeout:0 Test-Too-long:0 Invalid:0 Wrong:0
OAR Tester for Rocky Linux 9
- [rtems-test] riscv32/rv32i: RTEMS_DEBUG, RTEMS_POSIX_API: Passed:631 Failed:14 Timeout:0 Test-Too-long:0 Invalid:0 Wrong:0
OAR Tester for Rocky Linux 9
- [rtems-test] riscv32/rv32imac: RTEMS_POSIX_API: Passed:631 Failed:13 Timeout:0 Test-Too-long:0 Invalid:1 Wrong:0
OAR Tester for Rocky Linux 9
- [rtems-test] riscv32/rv32imac: RTEMS_DEBUG, RTEMS_POSIX_API: Passed:631 Failed:14 Timeout:0 Test-Too-long:0 Invalid:0 Wrong:0
OAR Tester for Rocky Linux 9
- [rtems-test] riscv32/rv32imafdc: RTEMS_POSIX_API: Passed:633 Failed:12 Timeout:0 Test-Too-long:0 Invalid:0 Wrong:0
OAR Tester for Rocky Linux 9
- [rtems-test] riscv32/rv32imafdc: RTEMS_DEBUG, RTEMS_POSIX_API: Passed:632 Failed:13 Timeout:0 Test-Too-long:0 Invalid:0 Wrong:0
OAR Tester for Rocky Linux 9
- [rtems-test] riscv64/rv64imac: RTEMS_POSIX_API: Passed:632 Failed:13 Timeout:0 Test-Too-long:0 Invalid:0 Wrong:0
OAR Tester for Rocky Linux 9
- [rtems-test] riscv64/rv64imac: RTEMS_DEBUG, RTEMS_POSIX_API: Passed:630 Failed:15 Timeout:0 Test-Too-long:0 Invalid:0 Wrong:0
OAR Tester for Rocky Linux 9
- [rtems-test] riscv64/rv64imafdc: RTEMS_POSIX_API: Passed:631 Failed:14 Timeout:0 Test-Too-long:0 Invalid:0 Wrong:0
OAR Tester for Rocky Linux 9
- [rtems-test] riscv64/rv64imafdc: RTEMS_DEBUG, RTEMS_POSIX_API: Passed:628 Failed:17 Timeout:0 Test-Too-long:0 Invalid:0 Wrong:0
OAR Tester for Rocky Linux 9
- [rtems-bsp-builder] 2026-09-23 14:20:50: Profile(s): everything
OAR Tester for Rocky Linux 9
- [rtems-test] sparc/erc32: RTEMS_POSIX_API: Passed:668 Failed:3 Timeout:0 Test-Too-long:0 Invalid:0 Wrong:0
OAR Tester for Rocky Linux 9
- [rtems-test] sparc/erc32: RTEMS_DEBUG, RTEMS_POSIX_API: Passed:666 Failed:5 Timeout:0 Test-Too-long:0 Invalid:0 Wrong:0
OAR Tester for Rocky Linux 9
- [rtems-test] sparc/leon2: RTEMS_POSIX_API: Passed:669 Failed:2 Timeout:0 Test-Too-long:0 Invalid:0 Wrong:0
OAR Tester for Rocky Linux 9
- [rtems-test] sparc/leon2: RTEMS_DEBUG, RTEMS_POSIX_API: Passed:667 Failed:4 Timeout:0 Test-Too-long:0 Invalid:0 Wrong:0
OAR Tester for Rocky Linux 9
- [rtems-test] sparc/leon3: RTEMS_POSIX_API: Passed:672 Failed:1 Timeout:0 Test-Too-long:0 Invalid:0 Wrong:0
OAR Tester for Rocky Linux 9
- [rtems-test] sparc/leon3: RTEMS_DEBUG, RTEMS_POSIX_API: Passed:670 Failed:3 Timeout:0 Test-Too-long:0 Invalid:0 Wrong:0
OAR Tester for Rocky Linux 9
- [rtems-test] powerpc/psim: RTEMS_POSIX_API: Passed:668 Failed:3 Timeout:0 Test-Too-long:0 Invalid:0 Wrong:0
OAR Tester for Rocky Linux 9
- [rtems-test] powerpc/psim: RTEMS_DEBUG, RTEMS_POSIX_API: Passed:665 Failed:6 Timeout:0 Test-Too-long:0 Invalid:0 Wrong:0
OAR Tester for Rocky Linux 9
- [rtems-test] mipstx39/jmr3904: RTEMS_POSIX_API: Passed:642 Failed:14 Timeout:13 Test-Too-long:1 Invalid:1 Wrong:0
OAR Tester for Rocky Linux 9
- [rtems-test] mipstx39/jmr3904: RTEMS_DEBUG, RTEMS_POSIX_API: Passed:641 Failed:15 Timeout:13 Test-Too-long:1 Invalid:1 Wrong:0
OAR Tester for Rocky Linux 9
- [rtems-test] riscv/griscv: RTEMS_POSIX_API: Passed:392 Failed:278 Timeout:0 Test-Too-long:0 Invalid:1 Wrong:0
OAR Tester for Rocky Linux 9
- [rtems-test] riscv/griscv: RTEMS_DEBUG, RTEMS_POSIX_API: Passed:382 Failed:288 Timeout:0 Test-Too-long:0 Invalid:1 Wrong:0
OAR Tester for Rocky Linux 9
- [rtems-test] sparc/leon3: RTEMS_POSIX_API, RTEMS_SMP: Passed:745 Failed:0 Timeout:0 Test-Too-long:0 Invalid:0 Wrong:0
OAR Tester for Rocky Linux 9
- [rtems-test] sparc/leon3: RTEMS_DEBUG, RTEMS_POSIX_API, RTEMS_SMP: Passed:743 Failed:2 Timeout:0 Test-Too-long:0 Invalid:0 Wrong:0
OAR Tester for Rocky Linux 9
- [rtems-test] arm/realview_pbx_a9_qemu: RTEMS_POSIX_API: Passed:665 Failed:7 Timeout:0 Test-Too-long:0 Invalid:0 Wrong:0
OAR Tester for Rocky Linux 9
- [rtems-test] arm/realview_pbx_a9_qemu: RTEMS_DEBUG, RTEMS_POSIX_API: Passed:663 Failed:9 Timeout:0 Test-Too-long:0 Invalid:0 Wrong:0
OAR Tester for Rocky Linux 9
- [rtems-test] arm/xilinx_zynq_a9_qemu: RTEMS_POSIX_API: Passed:666 Failed:7 Timeout:0 Test-Too-long:0 Invalid:0 Wrong:0
OAR Tester for Rocky Linux 9
- [rtems-test] arm/xilinx_zynq_a9_qemu: RTEMS_DEBUG, RTEMS_POSIX_API: Passed:664 Failed:9 Timeout:0 Test-Too-long:0 Invalid:0 Wrong:0
OAR Tester for Rocky Linux 9
- [rtems-test] arm/xilinx_zynq_zc706: RTEMS_POSIX_API: Passed:665 Failed:8 Timeout:0 Test-Too-long:0 Invalid:0 Wrong:0
OAR Tester for Rocky Linux 9
- [rtems-test] arm/xilinx_zynq_zc706: RTEMS_DEBUG, RTEMS_POSIX_API: Passed:663 Failed:10 Timeout:0 Test-Too-long:0 Invalid:0 Wrong:0
OAR Tester for Rocky Linux 9
- [rtems-test] aarch64/a53_ilp32_qemu: RTEMS_POSIX_API: Passed:664 Failed:10 Timeout:0 Test-Too-long:0 Invalid:0 Wrong:0
OAR Tester for Rocky Linux 9
- [rtems-test] aarch64/a53_ilp32_qemu: RTEMS_DEBUG, RTEMS_POSIX_API: Passed:662 Failed:12 Timeout:0 Test-Too-long:0 Invalid:0 Wrong:0
OAR Tester for Rocky Linux 9
- [rtems-test] aarch64/a53_lp64_qemu: RTEMS_POSIX_API: Passed:672 Failed:2 Timeout:0 Test-Too-long:0 Invalid:0 Wrong:0
OAR Tester for Rocky Linux 9
- [rtems-test] aarch64/a53_lp64_qemu: RTEMS_DEBUG, RTEMS_POSIX_API: Passed:669 Failed:5 Timeout:0 Test-Too-long:0 Invalid:0 Wrong:0
OAR Tester for Rocky Linux 9
- [rtems-test] i386/pc686: RTEMS_POSIX_API: Passed:659 Failed:1 Timeout:1 Test-Too-long:0 Invalid:10 Wrong:0
OAR Tester for Rocky Linux 9
- [rtems-test] i386/pc686: RTEMS_DEBUG, RTEMS_POSIX_API: Passed:657 Failed:3 Timeout:1 Test-Too-long:0 Invalid:10 Wrong:0
OAR Tester for Rocky Linux 9
- [rtems-test] i386/pc686: RTEMS_POSIX_API: Passed:656 Failed:4 Timeout:1 Test-Too-long:0 Invalid:10 Wrong:0
OAR Tester for Rocky Linux 9
- [rtems-test] i386/pc686: RTEMS_DEBUG, RTEMS_POSIX_API: Passed:654 Failed:6 Timeout:1 Test-Too-long:0 Invalid:10 Wrong:0
OAR Tester for Rocky Linux 9
- [rtems-bsp-builder] 2026-09-25 02:53:28: Profile(s): everything
OAR Tester for Rocky Linux 9
- [rtems-test] sparc/erc32: RTEMS_POSIX_API: Passed:668 Failed:3 Timeout:0 Test-Too-long:0 Invalid:0 Wrong:0
OAR Tester for Rocky Linux 9
- [rtems-test] sparc/erc32: RTEMS_DEBUG, RTEMS_POSIX_API: Passed:666 Failed:5 Timeout:0 Test-Too-long:0 Invalid:0 Wrong:0
OAR Tester for Rocky Linux 9
- [rtems-test] sparc/leon2: RTEMS_POSIX_API: Passed:669 Failed:2 Timeout:0 Test-Too-long:0 Invalid:0 Wrong:0
OAR Tester for Rocky Linux 9
- [rtems-test] sparc/leon2: RTEMS_DEBUG, RTEMS_POSIX_API: Passed:667 Failed:4 Timeout:0 Test-Too-long:0 Invalid:0 Wrong:0
OAR Tester for Rocky Linux 9
- [rtems-test] sparc/leon3: RTEMS_POSIX_API: Passed:672 Failed:1 Timeout:0 Test-Too-long:0 Invalid:0 Wrong:0
OAR Tester for Rocky Linux 9
- [rtems-test] sparc/leon3: RTEMS_DEBUG, RTEMS_POSIX_API: Passed:670 Failed:3 Timeout:0 Test-Too-long:0 Invalid:0 Wrong:0
OAR Tester for Rocky Linux 9
- [rtems-test] powerpc/psim: RTEMS_POSIX_API: Passed:668 Failed:3 Timeout:0 Test-Too-long:0 Invalid:0 Wrong:0
OAR Tester for Rocky Linux 9
- [rtems-test] powerpc/psim: RTEMS_DEBUG, RTEMS_POSIX_API: Passed:665 Failed:6 Timeout:0 Test-Too-long:0 Invalid:0 Wrong:0
OAR Tester for Rocky Linux 9
- [rtems-test] mipstx39/jmr3904: RTEMS_POSIX_API: Passed:641 Failed:15 Timeout:13 Test-Too-long:1 Invalid:1 Wrong:0
OAR Tester for Rocky Linux 9
- [rtems-test] mipstx39/jmr3904: RTEMS_DEBUG, RTEMS_POSIX_API: Passed:641 Failed:15 Timeout:13 Test-Too-long:1 Invalid:1 Wrong:0
OAR Tester for Rocky Linux 9
- [rtems-test] riscv/griscv: RTEMS_POSIX_API: Passed:392 Failed:278 Timeout:0 Test-Too-long:0 Invalid:1 Wrong:0
OAR Tester for Rocky Linux 9
- [rtems-test] riscv/griscv: RTEMS_DEBUG, RTEMS_POSIX_API: Passed:382 Failed:288 Timeout:0 Test-Too-long:0 Invalid:1 Wrong:0
OAR Tester for Rocky Linux 9
- [rtems-test] sparc/leon3: RTEMS_POSIX_API, RTEMS_SMP: Passed:745 Failed:0 Timeout:0 Test-Too-long:0 Invalid:0 Wrong:0
OAR Tester for Rocky Linux 9
- [rtems-test] sparc/leon3: RTEMS_DEBUG, RTEMS_POSIX_API, RTEMS_SMP: Passed:743 Failed:2 Timeout:0 Test-Too-long:0 Invalid:0 Wrong:0
OAR Tester for Rocky Linux 9
- [rtems-test] arm/realview_pbx_a9_qemu: RTEMS_POSIX_API: Passed:665 Failed:7 Timeout:0 Test-Too-long:0 Invalid:0 Wrong:0
OAR Tester for Rocky Linux 9
- [rtems-test] arm/realview_pbx_a9_qemu: RTEMS_DEBUG, RTEMS_POSIX_API: Passed:663 Failed:9 Timeout:0 Test-Too-long:0 Invalid:0 Wrong:0
OAR Tester for Rocky Linux 9
- [rtems-test] arm/xilinx_zynq_a9_qemu: RTEMS_POSIX_API: Passed:666 Failed:7 Timeout:0 Test-Too-long:0 Invalid:0 Wrong:0
OAR Tester for Rocky Linux 9
- [rtems-test] arm/xilinx_zynq_a9_qemu: RTEMS_DEBUG, RTEMS_POSIX_API: Passed:664 Failed:9 Timeout:0 Test-Too-long:0 Invalid:0 Wrong:0
OAR Tester for Rocky Linux 9
- [rtems-test] arm/xilinx_zynq_zc706: RTEMS_POSIX_API: Passed:665 Failed:8 Timeout:0 Test-Too-long:0 Invalid:0 Wrong:0
OAR Tester for Rocky Linux 9
- [rtems-test] arm/xilinx_zynq_zc706: RTEMS_DEBUG, RTEMS_POSIX_API: Passed:663 Failed:10 Timeout:0 Test-Too-long:0 Invalid:0 Wrong:0
OAR Tester for Rocky Linux 9
- [rtems-test] aarch64/a53_ilp32_qemu: RTEMS_POSIX_API: Passed:664 Failed:10 Timeout:0 Test-Too-long:0 Invalid:0 Wrong:0
OAR Tester for Rocky Linux 9
- [rtems-test] aarch64/a53_ilp32_qemu: RTEMS_DEBUG, RTEMS_POSIX_API: Passed:662 Failed:12 Timeout:0 Test-Too-long:0 Invalid:0 Wrong:0
OAR Tester for Rocky Linux 9
- [rtems-test] aarch64/a53_lp64_qemu: RTEMS_POSIX_API: Passed:672 Failed:2 Timeout:0 Test-Too-long:0 Invalid:0 Wrong:0
OAR Tester for Rocky Linux 9
- [rtems-test] aarch64/a53_lp64_qemu: RTEMS_DEBUG, RTEMS_POSIX_API: Passed:669 Failed:5 Timeout:0 Test-Too-long:0 Invalid:0 Wrong:0
OAR Tester for Rocky Linux 9
- [rtems-test] i386/pc686: RTEMS_POSIX_API: Passed:659 Failed:1 Timeout:1 Test-Too-long:0 Invalid:10 Wrong:0
OAR Tester for Rocky Linux 9
- [rtems-test] i386/pc686: RTEMS_DEBUG, RTEMS_POSIX_API: Passed:657 Failed:3 Timeout:1 Test-Too-long:0 Invalid:10 Wrong:0
OAR Tester for Rocky Linux 9
- [rtems-test] i386/pc686: RTEMS_POSIX_API: Passed:656 Failed:4 Timeout:1 Test-Too-long:0 Invalid:10 Wrong:0
OAR Tester for Rocky Linux 9
- [rtems-test] i386/pc686: RTEMS_DEBUG, RTEMS_POSIX_API: Passed:654 Failed:6 Timeout:1 Test-Too-long:0 Invalid:10 Wrong:0
OAR Tester for Rocky Linux 9
- [rtems-bsp-builder] 2026-09-26 02:53:11: Profile(s): everything
OAR Tester for Rocky Linux 9
- [rtems-bsp-builder] 2026-08-30 08:02:14: Profile(s): everything
OAR Tester for MAC
- Build Darwin: PASSED next/rtems-aarch64 on arm64-apple-darwin25.5.0
OAR Tester for MAC
- Build Darwin: PASSED next/rtems-arm on arm64-apple-darwin25.5.0
OAR Tester for MAC
- Build Darwin: PASSED next/rtems-i386 on arm64-apple-darwin25.5.0
OAR Tester for MAC
- Build Darwin: PASSED next/rtems-m68k on arm64-apple-darwin25.5.0
OAR Tester for MAC
- Build Darwin: FAILED next/rtems-microblaze on arm64-apple-darwin25.5.0 (microblaze-rtems7-binutils-7af075d-arm64-apple-darwin25.5.0-1)
OAR Tester for MAC
- Build Darwin: FAILED next/rtems-mips on arm64-apple-darwin25.5.0 (mipstx39-rtems7-gdb-16.1-arm64-apple-darwin25.5.0-1)
OAR Tester for MAC
- Build Darwin: PASSED next/rtems-moxie on arm64-apple-darwin25.5.0
OAR Tester for MAC
- Build Darwin: FAILED next/rtems-nios2 on arm64-apple-darwin25.5.0 (nios2-rtems7-gdb-15.2-arm64-apple-darwin25.5.0-1)
OAR Tester for MAC
- Build Darwin: PASSED next/rtems-or1k on arm64-apple-darwin25.5.0
OAR Tester for MAC
- Build Darwin: PASSED next/rtems-powerpc on arm64-apple-darwin25.5.0
OAR Tester for MAC
- Build Darwin: FAILED next/rtems-riscv on arm64-apple-darwin25.5.0 (sis-6cf1cfc91f8fcc2ae6b5461568feee4738f5e042-arm64-apple-darwin25.5.0-1)
OAR Tester for MAC
- Build Darwin: FAILED next/rtems-sparc on arm64-apple-darwin25.5.0 (sis-6cf1cfc91f8fcc2ae6b5461568feee4738f5e042-arm64-apple-darwin25.5.0-1)
OAR Tester for MAC
- Build Darwin: PASSED next/rtems-x86_64 on arm64-apple-darwin25.5.0
OAR Tester for MAC
- Build Darwin: PASSED devel/dtc on arm64-apple-darwin25.5.0
OAR Tester for MAC
- Build Darwin: PASSED devel/spike on arm64-apple-darwin25.5.0
OAR Tester for MAC
- Build Darwin: FAILED devel/qemu on arm64-apple-darwin25.5.0 (gettext-0.26-arm64-apple-darwin25.5.0-1)
OAR Tester for MAC
- [rtems-bsp-builder] 2026-09-04 06:53:01: Profile(s): everything
OAR Tester for MAC
- Build Darwin: PASSED 6/rtems-aarch64 on arm64-apple-darwin25.5.0
OAR Tester for MAC
- Build Darwin: PASSED 6/rtems-arm on arm64-apple-darwin25.5.0
OAR Tester for MAC
- Build Darwin: PASSED 6/rtems-bfin on arm64-apple-darwin25.5.0
OAR Tester for MAC
- Build Darwin: PASSED 6/rtems-i386 on arm64-apple-darwin25.5.0
OAR Tester for MAC
- Build Darwin: PASSED 6/rtems-lm32 on arm64-apple-darwin25.5.0
OAR Tester for MAC
- Build Darwin: PASSED 6/rtems-m68k on arm64-apple-darwin25.5.0
OAR Tester for MAC
- Build Darwin: FAILED 6/rtems-microblaze on arm64-apple-darwin25.5.0 (microblaze-rtems6-gdb-15.2-arm64-apple-darwin25.5.0-1)
OAR Tester for MAC
- Build Darwin: FAILED 6/rtems-mips on arm64-apple-darwin25.5.0 (mips-rtems6-gcc-13.3.0-newlib-1b3dcfd-arm64-apple-darwin25.5.0-1)
OAR Tester for MAC
- Build Darwin: PASSED 6/rtems-moxie on arm64-apple-darwin25.5.0
OAR Tester for MAC
- Build Darwin: FAILED 6/rtems-nios2 on arm64-apple-darwin25.5.0 (nios2-rtems6-gdb-15.2-arm64-apple-darwin25.5.0-1)
OAR Tester for MAC
- Build Darwin: PASSED 6/rtems-or1k on arm64-apple-darwin25.5.0
OAR Tester for MAC
- Build Darwin: PASSED 6/rtems-powerpc on arm64-apple-darwin25.5.0
OAR Tester for MAC
- Build Darwin: PASSED 7/rtems-aarch64 on arm64-apple-darwin25.5.0
OAR Tester for MAC
- Build Darwin: FAILED 6/rtems-riscv on arm64-apple-darwin25.5.0 (sis-e785959b498edcdf40e858631545a24b839d597f-arm64-apple-darwin25.5.0-1)
OAR Tester for MAC
- Build Darwin: PASSED 6/rtems-sh on arm64-apple-darwin25.5.0
OAR Tester for MAC
- Build Darwin: PASSED 7/rtems-arm on arm64-apple-darwin25.5.0
OAR Tester for MAC
- Build Darwin: PASSED 7/rtems-i386 on arm64-apple-darwin25.5.0
OAR Tester for MAC
- Build Darwin: FAILED 6/rtems-sparc on arm64-apple-darwin25.5.0 (sis-e785959b498edcdf40e858631545a24b839d597f-arm64-apple-darwin25.5.0-1)
OAR Tester for MAC
- Build Darwin: PASSED 6/rtems-sparc64 on arm64-apple-darwin25.5.0
OAR Tester for MAC
- Build Darwin: PASSED 6/rtems-v850 on arm64-apple-darwin25.5.0
OAR Tester for MAC
- Build Darwin: PASSED 7/rtems-m68k on arm64-apple-darwin25.5.0
OAR Tester for MAC
- Build Darwin: FAILED 7/rtems-microblaze on arm64-apple-darwin25.5.0 (microblaze-rtems7-binutils-7af075d-arm64-apple-darwin25.5.0-1)
OAR Tester for MAC
- Build Darwin: PASSED 6/rtems-x86_64 on arm64-apple-darwin25.5.0
OAR Tester for MAC
- Build Darwin: PASSED devel/dtc on arm64-apple-darwin25.5.0
OAR Tester for MAC
- Build Darwin: PASSED devel/spike on arm64-apple-darwin25.5.0
OAR Tester for MAC
- Build Darwin: PASSED devel/qemu on arm64-apple-darwin25.5.0
OAR Tester for MAC
- Build Darwin: FAILED 7/rtems-mips on arm64-apple-darwin25.5.0 (mipstx39-rtems7-gdb-16.1-arm64-apple-darwin25.5.0-1)
OAR Tester for MAC
- Build Darwin: PASSED 7/rtems-moxie on arm64-apple-darwin25.5.0
OAR Tester for MAC
- Build Darwin: FAILED 7/rtems-nios2 on arm64-apple-darwin25.5.0 (nios2-rtems7-gdb-15.2-arm64-apple-darwin25.5.0-1)
OAR Tester for MAC
- Build Darwin: PASSED next/rtems-aarch64 on arm64-apple-darwin25.5.0
OAR Tester for MAC
- Build Darwin: PASSED 7/rtems-or1k on arm64-apple-darwin25.5.0
OAR Tester for MAC
- Build Darwin: FAILED 7/rtems-powerpc on arm64-apple-darwin25.5.0 (powerpc-rtems7-gcc-15.2.0-newlib-7d4336cf-arm64-apple-darwin25.5.0-1)
OAR Tester for MAC
- Build Darwin: PASSED next/rtems-aarch64 on arm64-apple-darwin25.5.0
OAR Tester for MAC
- Build Darwin: PASSED next/rtems-arm on arm64-apple-darwin25.5.0
OAR Tester for MAC
- Build Darwin: PASSED next/rtems-i386 on arm64-apple-darwin25.5.0
OAR Tester for MAC
- Build Darwin: PASSED next/rtems-m68k on arm64-apple-darwin25.5.0
OAR Tester for MAC
- Build Darwin: FAILED next/rtems-microblaze on arm64-apple-darwin25.5.0 (microblaze-rtems7-binutils-7af075d-arm64-apple-darwin25.5.0-1)
OAR Tester for MAC
- Build Darwin: FAILED next/rtems-mips on arm64-apple-darwin25.5.0 (mipstx39-rtems7-gdb-16.1-arm64-apple-darwin25.5.0-1)
OAR Tester for MAC
- Build Darwin: PASSED next/rtems-moxie on arm64-apple-darwin25.5.0
OAR Tester for MAC
- Build Darwin: FAILED next/rtems-nios2 on arm64-apple-darwin25.5.0 (nios2-rtems7-gdb-15.2-arm64-apple-darwin25.5.0-1)
OAR Tester for MAC
- Build Darwin: PASSED next/rtems-or1k on arm64-apple-darwin25.5.0
OAR Tester for MAC
- Build Darwin: PASSED next/rtems-powerpc on arm64-apple-darwin25.5.0
OAR Tester for MAC
- Build Darwin: FAILED next/rtems-riscv on arm64-apple-darwin25.5.0 (sis-6cf1cfc91f8fcc2ae6b5461568feee4738f5e042-arm64-apple-darwin25.5.0-1)
OAR Tester for MAC
- Build Darwin: FAILED next/rtems-sparc on arm64-apple-darwin25.5.0 (sis-6cf1cfc91f8fcc2ae6b5461568feee4738f5e042-arm64-apple-darwin25.5.0-1)
OAR Tester for MAC
- Build Darwin: PASSED next/rtems-x86_64 on arm64-apple-darwin25.5.0
OAR Tester for MAC
- Build Darwin: PASSED devel/dtc on arm64-apple-darwin25.5.0
OAR Tester for MAC
- Build Darwin: PASSED devel/spike on arm64-apple-darwin25.5.0
OAR Tester for MAC
- Build Darwin: FAILED devel/qemu on arm64-apple-darwin25.5.0 (gettext-0.26-arm64-apple-darwin25.5.0-1)
OAR Tester for MAC
- [rtems-bsp-builder] 2026-09-11 07:20:52: Profile(s): everything
OAR Tester for MAC
- [rtems-bsp-builder] 2026-09-15 00:13:32: Profile(s): everything
OAR Tester for MAC
- [rtems-bsp-builder] 2026-09-01 16:22:06: Profile(s): everything
Joel Sherrill
- [rtems-bsp-builder] 2026-09-02 14:45:07: Profile(s): everything
Joel Sherrill
- [rtems-bsp-builder] 2026-09-03 11:27:47: Profile(s): everything
Joel Sherrill
- Build Linux: PASSED 6/rtems-aarch64 on x86_64-linux-gnu
Joel Sherrill
- Build Linux: PASSED 6/rtems-arm on x86_64-linux-gnu
Joel Sherrill
- Build Linux: PASSED 6/rtems-bfin on x86_64-linux-gnu
Joel Sherrill
- Build Linux: PASSED 6/rtems-i386 on x86_64-linux-gnu
Joel Sherrill
- Build Linux: PASSED 6/rtems-lm32 on x86_64-linux-gnu
Joel Sherrill
- Build Linux: PASSED 6/rtems-m68k on x86_64-linux-gnu
Joel Sherrill
- Build Linux: FAILED 6/rtems-microblaze on x86_64-linux-gnu (microblaze-rtems6-gdb-15.2-x86_64-linux-gnu-1)
Joel Sherrill
- Build Linux: PASSED 6/rtems-mips on x86_64-linux-gnu
Joel Sherrill
- Build Linux: PASSED 6/rtems-moxie on x86_64-linux-gnu
Joel Sherrill
- Build Linux: PASSED 6/rtems-nios2 on x86_64-linux-gnu
Joel Sherrill
- Build Linux: PASSED 6/rtems-or1k on x86_64-linux-gnu
Joel Sherrill
- Build Linux: PASSED 6/rtems-powerpc on x86_64-linux-gnu
Joel Sherrill
- Build Linux: PASSED 6/rtems-riscv on x86_64-linux-gnu
Joel Sherrill
- Build Linux: PASSED 6/rtems-sh on x86_64-linux-gnu
Joel Sherrill
- Build Linux: PASSED 6/rtems-sparc on x86_64-linux-gnu
Joel Sherrill
- Build Linux: PASSED 6/rtems-sparc64 on x86_64-linux-gnu
Joel Sherrill
- Build Linux: PASSED 6/rtems-v850 on x86_64-linux-gnu
Joel Sherrill
- Build Linux: PASSED 6/rtems-x86_64 on x86_64-linux-gnu
Joel Sherrill
- Build Linux: PASSED devel/dtc on x86_64-linux-gnu
Joel Sherrill
- Build Linux: PASSED devel/spike on x86_64-linux-gnu
Joel Sherrill
- Build Linux: FAILED devel/qemu on x86_64-linux-gnu (qemu-5.2.0-x86_64-linux-gnu-1)
Joel Sherrill
- [rtems-test] sparc/erc32: RTEMS_POSIX_API: Passed:635 Failed:9 Timeout:0 Test-Too-long:0 Invalid:0 Wrong:0
Joel Sherrill
- [rtems-test] sparc/erc32: RTEMS_DEBUG, RTEMS_POSIX_API: Passed:638 Failed:6 Timeout:0 Test-Too-long:0 Invalid:0 Wrong:0
Joel Sherrill
- [rtems-test] sparc/leon2: RTEMS_POSIX_API: Passed:642 Failed:2 Timeout:0 Test-Too-long:0 Invalid:0 Wrong:0
Joel Sherrill
- [rtems-test] sparc/leon2: RTEMS_DEBUG, RTEMS_POSIX_API: Passed:640 Failed:4 Timeout:0 Test-Too-long:0 Invalid:0 Wrong:0
Joel Sherrill
- [rtems-test] sparc/leon3: RTEMS_POSIX_API: Passed:645 Failed:1 Timeout:0 Test-Too-long:0 Invalid:0 Wrong:0
Joel Sherrill
- [rtems-test] sparc/leon3: RTEMS_DEBUG, RTEMS_POSIX_API: Passed:643 Failed:3 Timeout:0 Test-Too-long:0 Invalid:0 Wrong:0
Joel Sherrill
- [rtems-test] sparc/leon3: RTEMS_POSIX_API, RTEMS_SMP: Passed:716 Failed:1 Timeout:0 Test-Too-long:0 Invalid:0 Wrong:0
Joel Sherrill
- [rtems-test] sparc/leon3: RTEMS_DEBUG, RTEMS_POSIX_API, RTEMS_SMP: Passed:715 Failed:2 Timeout:0 Test-Too-long:0 Invalid:0 Wrong:0
Joel Sherrill
- [rtems-test] riscv32/rv32i: RTEMS_POSIX_API: Passed:633 Failed:12 Timeout:0 Test-Too-long:0 Invalid:0 Wrong:0
Joel Sherrill
- [rtems-test] riscv32/rv32i: RTEMS_DEBUG, RTEMS_POSIX_API: Passed:631 Failed:14 Timeout:0 Test-Too-long:0 Invalid:0 Wrong:0
Joel Sherrill
- [rtems-test] riscv32/rv32imac: RTEMS_POSIX_API: Passed:630 Failed:14 Timeout:0 Test-Too-long:0 Invalid:1 Wrong:0
Joel Sherrill
- [rtems-test] riscv32/rv32imac: RTEMS_DEBUG, RTEMS_POSIX_API: Passed:630 Failed:15 Timeout:0 Test-Too-long:0 Invalid:0 Wrong:0
Joel Sherrill
- [rtems-test] riscv32/rv32imafdc: RTEMS_POSIX_API: Passed:633 Failed:12 Timeout:0 Test-Too-long:0 Invalid:0 Wrong:0
Joel Sherrill
- [rtems-test] riscv32/rv32imafdc: RTEMS_DEBUG, RTEMS_POSIX_API: Passed:632 Failed:13 Timeout:0 Test-Too-long:0 Invalid:0 Wrong:0
Joel Sherrill
- [rtems-test] riscv64/rv64imac: RTEMS_POSIX_API: Passed:632 Failed:13 Timeout:0 Test-Too-long:0 Invalid:0 Wrong:0
Joel Sherrill
- [rtems-test] riscv64/rv64imac: RTEMS_DEBUG, RTEMS_POSIX_API: Passed:630 Failed:15 Timeout:0 Test-Too-long:0 Invalid:0 Wrong:0
Joel Sherrill
- [rtems-test] riscv64/rv64imafdc: RTEMS_POSIX_API: Passed:631 Failed:14 Timeout:0 Test-Too-long:0 Invalid:0 Wrong:0
Joel Sherrill
- [rtems-test] riscv64/rv64imafdc: RTEMS_DEBUG, RTEMS_POSIX_API: Passed:628 Failed:17 Timeout:0 Test-Too-long:0 Invalid:0 Wrong:0
Joel Sherrill
- [rtems-bsp-builder] 2026-09-04 08:47:47: Profile(s): everything
Joel Sherrill
- [rtems-bsp-builder] 2026-09-05 12:04:02: Profile(s): everything
Joel Sherrill
- [rtems-bsp-builder] 2026-09-05 18:36:22: Profile(s): everything
Joel Sherrill
- [rtems-bsp-builder] 2026-09-16 17:25:05: Profile(s): everything
Joel Sherrill
- [rtems-bsp-builder] 2026-09-21 14:05:27: Profile(s): everything
Joel Sherrill
- [rtems-bsp-builder] 2026-09-25 10:28:36: Profile(s): everything
Joel Sherrill
- [rtems-bsp-builder] 2026-09-25 19:42:03: Profile(s): everything
Joel Sherrill
- Build Linux: PASSED 7/rtems-sparc on x86_64-linux-gnu
joel at rtems.org
- Build Linux: PASSED 7/rtems-sparc on x86_64-linux-gnu
joel at rtems.org
- Build Linux: PASSED 7/rtems-arm on x86_64-linux-gnu
joel at rtems.org
- Build Linux: PASSED 7/rtems-i386 on x86_64-linux-gnu
joel at rtems.org
- Build Linux: PASSED 7/rtems-m68k on x86_64-linux-gnu
joel at rtems.org
- Build Linux: PASSED 7/rtems-mips on x86_64-linux-gnu
joel at rtems.org
- Build Linux: PASSED 7/rtems-moxie on x86_64-linux-gnu
joel at rtems.org
- Build Linux: PASSED 7/rtems-nios2 on x86_64-linux-gnu
joel at rtems.org
- Build Linux: PASSED 7/rtems-or1k on x86_64-linux-gnu
joel at rtems.org
- Build Linux: PASSED 7/rtems-powerpc on x86_64-linux-gnu
joel at rtems.org
- Build Linux: PASSED 7/rtems-riscv on x86_64-linux-gnu
joel at rtems.org
- Build Linux: PASSED 7/rtems-microblaze on x86_64-linux-gnu
joel at rtems.org
- Build Linux: PASSED 7/rtems-aarch64 on x86_64-linux-gnu
joel at rtems.org
- Build Linux: PASSED 7/rtems-x86_64 on x86_64-linux-gnu
joel at rtems.org
- Build Linux: PASSED next/rtems-sparc on x86_64-linux-gnu
joel at rtems.org
- Build Linux: PASSED next/rtems-arm on x86_64-linux-gnu
joel at rtems.org
- Build Linux: PASSED next/rtems-i386 on x86_64-linux-gnu
joel at rtems.org
- Build Linux: PASSED next/rtems-m68k on x86_64-linux-gnu
joel at rtems.org
- Build Linux: PASSED next/rtems-mips on x86_64-linux-gnu
joel at rtems.org
- Build Linux: PASSED next/rtems-moxie on x86_64-linux-gnu
joel at rtems.org
- Build Linux: PASSED next/rtems-nios2 on x86_64-linux-gnu
joel at rtems.org
- Build Linux: PASSED next/rtems-or1k on x86_64-linux-gnu
joel at rtems.org
- Build Linux: PASSED next/rtems-powerpc on x86_64-linux-gnu
joel at rtems.org
- Build Linux: PASSED next/rtems-riscv on x86_64-linux-gnu
joel at rtems.org
- Build Linux: PASSED next/rtems-microblaze on x86_64-linux-gnu
joel at rtems.org
- Build Linux: PASSED next/rtems-aarch64 on x86_64-linux-gnu
joel at rtems.org
- Build Linux: PASSED next/rtems-x86_64 on x86_64-linux-gnu
joel at rtems.org
Last message date:
Wed Sep 30 22:28:37 UTC 2026
Archived on: Wed Sep 30 22:29:39 UTC 2026
This archive was generated by
Pipermail 0.09 (Mailman edition).