ARM BSP build failure.

Chris Johns chrisj at
Wed Oct 30 06:18:42 UTC 2019


Building all ARM BSPs on master today I get ...

checking for arm-rtems5-gcc... (cached) arm-rtems5-gcc
checking whether the C compiler works... no
configure: error: in
configure: error: C compiler cannot create executables
See `config.log' for more details
gmake[2]: *** [Makefile:1064: lpc40xx_ea_ram] Error 1
gmake[2]: Leaving directory '/opt/work/chris/rtems/kernel/bsps/arm/arm-rtems5/c'
gmake[1]: *** [Makefile:289: all-recursive] Error 1
gmake[1]: Leaving directory '/opt/work/chris/rtems/kernel/bsps/arm/arm-rtems5/c'

Is the lpc40xx_ea_ram BSP OK?


More information about the devel mailing list