Problem to save file on the hard disk! What I have to set to do it ?

Matteo matteo.posterli at
Fri Mar 17 11:55:24 UTC 2006

Infact I installed this version of rtems because with that suggested from the
"download helper" I had some problem.
So, I decid to reinstall all rtems with the version suggest from the download
helper(so I'm sure that all the samples works!);
So I applied the patch for gcc and newlib, a export the 
 export PATH="$PATH:/usr/local/rtems/rtems4.7/bin" 

I configure binutils in this way;

../binutils-2.16.1/configure --target=i386-rtems4.7 

and I launch "make -w all install", but I have this error ;
Wmissing-prototypes -g -O2 -c ../../binutils-
In file included from ./targ-cpu.h:1,
                 from ../../binutils-,
                 from ./obj-format.h:1,
                 from ../../binutils-,
                 from ./targ-env.h:1,
                 from ../../binutils-,
                 from ../../binutils-
../../binutils- error: array type has
incomplete element type
make[3]: *** [app.o] Error 1
make[3]: Leaving directory `/usr/local/rtems/source/tools/b-binutils/gas'
make[2]: *** [all-recursive] Error 1
make[2]: Leaving directory `/usr/local/rtems/source/tools/b-binutils/gas'
make[1]: *** [all-recursive-am] Error 2
make[1]: Leaving directory `/usr/local/rtems/source/tools/b-binutils/gas'
make: *** [all-gas] Error 2
make: Leaving directory `/usr/local/rtems/source/tools/b-binutils'
root at matteo:/usr/local/rtems/source/tools/b-binutils#

That was the same error that convinced me to try another version of rtems.

So have you some idea about to resolve this configuration problem ?

Thanks in advance 


More information about the users mailing list