Buliding Error

Chris Johns chrisj at rtems.org
Mon May 19 03:06:36 UTC 2014

On 19/05/2014 7:11 am, Kumar Amit Mehta wrote:
> On Sun, May 18, 2014 at 10:34:50PM +0200, Kempf, Fabian Ernst-Wilhelm wrote:
>> I have an error during building rtems.
>> Can someone give me a quick solution how I can fix it.
>> The terminal prints:
>> config: tools/rtems-gdb-7.7-1.cfg
>> package: sparc-rtems4.11-gdb-7.7-1
>> building: sparc-rtems4.11-gdb-7.7-1
>> error: building sparc-rtems4.11-gdb-7.7-1
>> Build FAILED
>>    See error report: rsb-report-sparc-rtems4.11-gdb-7.7-1.txt
>> Build Set: Time 1:30:18.831806
>> Build FAILED
>> The log files are attached.

Thanks for posting the error report. This was add a week so ago and 
already has proved useful.

>> patching file sim/erc32/sis.h
>> Hunk #1 FAILED at 159.
>> 1 out of 1 hunk FAILED -- saving rejects to file sim/erc32/sis.h.rej
>> shell cmd failed: /bin/sh -ex  /home/rtems/rtems-4.11-work/rtems/rtems-source-builder/rtems/build/sparc-rtems4.11-gdb-7.7-1/doit
>> error: building sparc-rtems4.11-gdb-7.7-1
> Quick look at the log file suggests me that there is something wrong
> with the directory structure as the patching failed.

The patch broke with gdb-7.7. I have updated the patch and pushed the 
changes. Please update your RSB repo and rebuild.


More information about the users mailing list